{"text_format":"2","workbook":"xlsx","n_sheets":2,"sheets":["Lista de Chequeo V8","Base"],"not_rendered":{"charts":0,"images":0,"macros":0,"external_links":0,"defined_names":36,"comments":1,"pivot_tables":0},"unopened":[],"bounds":{"document_bytes":16777216,"sheet_cells":100000,"run_cost":"one","rows_first":2000,"rows_last":500,"rows_between":2000,"halvings":0,"cell_chars":16384,"cell_head_chars":4096},"cells_cut":0,"cells_raw":0,"read":"whole","date_system":"1900"}

{"sheet":"Lista de Chequeo V8","index":0,"n_rows":172,"n_cols":11,"rows_kept":172,"cut":false,"hidden":false,"merged":[[168,1,170,9],[171,1,171,9],[79,10,86,10],[87,10,98,10],[87,6,98,6],[67,7,72,9],[79,6,86,6],[125,10,133,10],[125,5,133,5],[155,1,167,9],[73,7,78,9],[79,1,86,4],[149,1,154,4],[149,5,154,5],[149,6,154,6],[149,7,154,9],[115,0,124,0],[115,1,124,4],[115,6,124,6],[115,7,124,9],[115,10,124,10],[99,10,108,10],[109,10,114,10],[87,5,98,5],[99,5,108,5],[109,5,114,5],[115,5,124,5],[109,1,114,4],[109,6,114,6],[109,7,114,9],[12,1,19,4],[11,7,11,9],[12,5,19,5],[141,1,148,4],[28,1,39,4],[125,1,133,4],[28,6,39,6],[20,5,27,5],[28,5,39,5],[40,5,45,5],[11,1,11,4],[12,7,19,9],[20,7,27,9],[99,1,108,4],[54,5,66,5],[67,5,72,5],[73,5,78,5],[79,5,86,5],[1,1,3,9],[5,4,5,9],[5,1,5,3],[6,8,6,10],[6,1,6,3],[4,6,4,9],[7,1,7,3],[7,4,7,9],[8,1,8,3],[8,4,8,9],[6,4,6,7],[4,1,4,5],[12,0,19,0],[40,0,45,0],[20,0,27,0],[20,6,27,6],[28,7,39,9],[20,1,27,4],[9,1,9,3],[73,10,78,10],[9,4,9,9],[54,10,64,10],[10,1,10,9],[67,10,71,10],[67,1,72,4],[20,10,27,10],[28,10,31,10],[40,10,44,10],[46,10,50,10],[46,7,53,9],[46,6,53,6],[12,6,19,6],[73,6,78,6],[28,0,39,0],[46,0,53,0],[46,5,53,5],[125,0,133,0],[125,6,133,6],[125,7,133,9],[67,6,72,6],[54,1,66,4],[54,7,66,9],[40,6,45,6],[54,6,66,6],[87,7,98,9],[99,0,108,0],[87,0,98,0],[79,0,86,0],[73,1,78,4],[73,0,78,0],[67,0,72,0],[54,0,66,0],[46,1,53,4],[40,1,45,4],[40,7,45,9],[109,0,114,0],[87,1,98,4],[99,6,108,6],[99,7,108,9],[79,7,86,9],[149,0,153,0],[141,5,148,5],[141,6,148,6],[141,7,148,9],[134,7,140,9],[134,6,140,6],[134,0,140,0],[141,0,148,0],[134,5,140,5],[134,1,140,4]]}
[]
[null,"                                                                                                PATRIMONIO AUTÓNOMO FIA\n(Versión 8 / Enero 2023)                                                            LISTA DE CHEQUEO - PROCESO DE PAGOS "]
[]
[]
[null,"Tipo de Pago",{"$nulls":4},"Autorización Pago a Terceros"]
[null,"Departamento"]
[null,"Identificación Contratista",null,null,"NIT"]
[null,"Nombre Completo Contratista"]
[null,"No de orden de pago"]
[null,"Valor Bruto Orden de Pago"]
[{"$f":"VLOOKUP(G5,Base!$A$2:$B$22,2,0)","v":7}]
[null,"Documentos",null,null,null,"GESTOR","FIA","Descripción"]
[{"$f":"VLOOKUP(B13,Base!$A$20:$B$66,2,0)","v":26},{"$f":"IFERROR(VLOOKUP($A$11,Base!$B$2:$S$20,2,0),\" \")","v":"Orden de pago a favor del contratista y Planilla de Autorización de Pago a Terceros."},{"$nulls":5},{"$f":"IFERROR(VLOOKUP(K13,Base!$B$21:$C$67,2,0),\" \")","v":"*Recuerde que la orden de pago se diligencia con la información del contratista y esta debe ser radicada en el formato PDF generado directamente desde el micrositio dispuesto por el Consorcio FIA para su elaboración y firma, sin presentar tachaduras ni enmendaduras; de igual forma debe estar completamente diligenciada y firmada por el ordenador del gasto y supervisor o interventor del proyecto, según sea el caso.\n*En la orden de pago, en el campo liquidación del pago, debe venir el detalle de los descuentos tales como impuestos, estampillas, embargos, multas, sanciones, autorización de pago a terceros y otros, de tal forma que los descuentos aplicados se encuentren debidamente discriminados y detallados.\n*En la Planilla de Autorización de Pago a Terceros, relacione la información requerida y correspondiente al tercero el cual se está autorizando el giro de los recursos.\nNotas: i) Los descuentos por Impuesto de Guerra (Contribución Especial sobre contratos de Obra Pública) y estampillas se liquidarán teniendo en cuenta el nivel de la Entidad Territorial Contratante (Municipal o Departamental), se requiere marcar con una X según el caso. ii) Los descuentos por concepto de Retefuente, Reteiva y Reteica, deben estar aproximados al mil más cercano en la liquidación de la orden de pago, el valor del reteica debe coincidir con el anexo de reteicas múltiples adjunto a la orden de pago (en los casos que aplique). iii) El valor indicado en la casilla “Autorización de Pago a Terceros” de la orden de pago debe coincidir con el valor descrito en la Planilla de Autorización de Pago a Terceros."},null,null,{"$f":"A13*1","v":26}]
{"$rows_empty":7}
[{"$f":"VLOOKUP(B21,Base!$A$20:$B$66,2,0)","v":2},{"$f":"IFERROR(VLOOKUP($A$11,Base!$B$2:$S$20,3,0),\" \")","v":"Factura, cuenta de cobro o documento equivalente."},{"$nulls":5},{"$f":"IFERROR(VLOOKUP(K21,Base!$B$21:$C$67,2,0),\" \")","v":"*FACTURA DE VENTA: Debe cumplir con los requisitos establecidos en el artículo 617 del E.T: 1. Estar denominada expresamente como factura de venta. 2. Apellidos y nombre o razón social y NIT del contratista o de quien presta el servicio. 3. *Modificado* Apellidos y nombre o razón social y NIT del adquirente de los bienes o servicios, junto con la discriminación del IVA pagado. 4. Llevar un número que corresponda a un sistema de numeración consecutiva de facturas de venta. 5. Fecha de su expedición. 6. Descripción específica o genérica de los artículos o servicios prestados. 7. Valor total de la operación. 8. El nombre o razón social y el NIT del impresor de la factura. 9. Indicar la calidad de retenedor del impuesto sobre las ventas. 10. Resolución de facturación vigente. \nNotas: i) En las facturas que correspondan a Consorcios o Uniones Temporales, incluir de manera informativa el porcentaje (%) de participación y régimen asignado por la DIAN, de cada uno de los integrantes de cada tipo de entidad. De igual forma se debe indicar si tienen la calidad de autorretenedores. ii) En las órdenes de pago a favor de un tercero obligado a facturar, es requisito indispensable adjuntar copia vigente de la resolución de facturación expedida por la DIAN. iii) En el caso de los contratos de obra que liquiden IVA, se debe describir la base y los porcentajes de AIU. \n\n*CUENTA DE COBRO O DOCUMENTO EQUIVALENTE: Debe cumplir con los requisitos de Ley, tales como: (Estar denominada expresamente como cuenta de cobro, fecha de elaboración, estar numerada, identificar el valor, número de acta o pago a cobrar, No. de contrato, concepto de pago, nombre y NIT del contratante y estar suscita por el contratista). Nota: i) De acuerdo con lo establecido en el Artículo 3 del Decreto 522 de 2003, es responsabilidad del CONTRATANTE la numeración que se manejan en las cuentas de cobro de los Contratistas que pertenezcan al Régimen Simplificado. ii) Acorde con lo dispuesto en Artículo 437-1 del Estatuto Tributario, la fecha de elaboración del documento soporte debe corresponder al mismo mes en el cual se radica y ejecuta el pago."},null,null,{"$f":"A21*1","v":2}]
{"$rows_empty":7}
[{"$f":"VLOOKUP(B29,Base!$A$20:$B$66,2,0)","v":27},{"$f":"IFERROR(VLOOKUP($A$11,Base!$B$2:$S$20,4,0),\" \")","v":"Certificación Bancaria y documentos del Tercero Autorizado."},{"$nulls":5},{"$f":"IFERROR(VLOOKUP(K29,Base!$B$21:$C$67,2,0),\" \")","v":"*Para cada pago a favor del tercero autorizado se debe adjuntar la certificación bancaria.\n\nDocumentos del Tercero Autorizado, según corresponda su naturaleza:\n\n**Persona Natural: Fotocopia del documento de identificación y Copia del RUT (en caso de no contar con el RUT, el Gestor debe remitir comunicación, indicando los datos completos de la persona natural, es decir: nombre completo, número de identificación, dirección y teléfono),\n**Persona Jurídica: Certificación de existencia y Representación Legal con vigencia no superior a tres (3) meses, Copia del RUT y Fotocopia del documento de identificación del representante legal.\n***Consorcios /Uniones temporales: Copia del acuerdo consorcial /unión temporal, Copia del registro único tributario (RUT) y fotocopia de la cédula del representante legal del Consorcio o Unión temporal a la cual se van a girar los recursos."},null,null,{"$f":"A29*1","v":27}]
{"$rows_empty":11}
[{"$f":"VLOOKUP(B41,Base!$A$20:$B$66,2,0)","v":4},{"$f":"IFERROR(VLOOKUP($A$11,Base!$B$2:$S$20,5,0),\" \")","v":"Plan de Pagos Actualizado."},{"$nulls":5},{"$f":"IFERROR(VLOOKUP(K41,Base!$B$21:$C$67,2,0),\" \")","v":"*El plan de pagos se debe enviar completo, ser legible e identificarse claramente el historial de los pagos realizados y el pago a realizar. Así mismo debe contener el Vo.Bo o nombre de la persona que lo elaboró en la Unidad Gestora.\n*Relacionar todos los valores correspondientes a anticipos, amortización de anticipos, pagos parciales y otros descuentos (Autorización Pago a Terceros, posición contractual). De igual forma, los gastos por desplazamientos se deben relacionar en un rubro diferente al de honorarios.\n*En pagos cuyos recursos van con cargo a varios CDR´s y/o fuentes, se debe evidenciar el valor a pagar por cada uno de los CDR`s y/o fuentes. Con el fin de hacer una correcta amortizacion, en los pagos correspondientes a giro anticipos, el valor del anticipo no debe superar el 50% del valor por cada CDR. \n*Para cualquier aclaración utilizar el campo denominado observaciones en el cual se encuentra ubicado en la parte inferior. \nNotas: i) La fecha del plan de pagos (encabezado) corresponde a la fecha actual. Respecto al periodo de pago, corresponde al (mes y año) cuando se realiza el trámite y giro por parte del P.A FIA. ii) Recuerde que cualquier inexactitud reportada en el plan de pagos es responsabilidad de la Unidad Gestora."},null,null,{"$f":"A41*1","v":4}]
[]
{"$rows_left_out":58}
{"sheet":"Base","index":1,"n_rows":103,"n_cols":24,"rows_kept":103,"cut":false,"hidden":true,"merged":[]}
[1,null,2,3,4,5,6,7,8,9,10,11,12,13,14,15,16,17,18]
["Primer Pago",1,"Orden de Pago.","Factura, cuenta de cobro o documento equivalente.","Certificación Bancaria.","Plan de Pagos Actualizado.","Pre Validador de Retención en la Fuente.","Anexo liquidación Reteicas Múltiples.","Lista de chequeo","Copia de CDR- Certificado de Disponibilidad de Recursos.","Documentos del beneficiario del pago.","Copia del contrato, Oferta en firme, Acto administrativo, Convenios y/o cualquier otra forma contractual que haya pactado el GESTOR o el FIDEICOMITENTE.","Designación de interventor o supervisor de contrato, con copia de Cédula, RUT y Certificado de Existencia y Representación Legal no superior a tres (3) meses o Acuerdo Consorcial / Unión Temporal, según aplique.","Copia del Acta Inicio","Copia de Acta parcial o Certificación de Cumplimiento","Soportes de Pago de Impuesto","Nota Primer Pago","Nota Formalidades de Impuestos","Nota Tarjeta Registro de Firmas"," "," "," "," "," "]
["Pago de Anticipo",2,"Orden de Pago.","Factura, cuenta de cobro o documento equivalente.","Certificación Bancaria.","Plan de Pagos Actualizado.","Lista de chequeo","Copia de CDR- Certificado de Disponibilidad de Recursos.","Documentos del beneficiario del pago.","Copia del contrato, Oferta en firme, Acto administrativo, Convenios y/o cualquier otra forma contractual que haya pactado el GESTOR o el FIDEICOMITENTE.","Designación de interventor o supervisor de contrato, con copia de Cédula, RUT y Certificado de Existencia y Representación Legal no superior a tres (3) meses o Acuerdo Consorcial / Unión Temporal, según aplique.","Copia del Acta Inicio","Certificación Bancaria - Impuesto Contribución Especial de Obra Pública.","Nota Formalidades de Impuestos","Nota Tarjeta Registro de Firmas",null,null,null," "," "," "]
["Pago Parcial o Pago Parcial con Amortización de Anticipo",3,"Orden de Pago.","Factura, cuenta de cobro o documento equivalente.","Plan de Pagos Actualizado.","Pre Validador de Retención en la Fuente.","Anexo liquidación Reteicas Múltiples.","Lista de chequeo","Copia de CDR- Certificado de Disponibilidad de Recursos.","Copia de Acta parcial o Certificación de Cumplimiento","Soportes de Pago de Impuesto","Nota Formalidades de Impuestos","Nota Tarjeta Registro de Firmas",null,null," "," "," "," "]
["Pago Parcial con Adición",4,"Orden de Pago.","Factura, cuenta de cobro o documento equivalente.","Plan de Pagos Actualizado.","Pre Validador de Retención en la Fuente.","Anexo liquidación Reteicas Múltiples.","Lista de chequeo","Copia de CDR- Certificado de Disponibilidad de Recursos.","Copia de la adición al contrato, Acto administrativo, Convenios y/o cualquier otra forma contractual que haya pactado el GESTOR o el FIDEICOMITENTE.","Copia de Acta parcial o Certificación de Cumplimiento","Soportes de Pago de Impuesto","Nota Formalidades de Impuestos","Nota Tarjeta Registro de Firmas"]
["Pagos al Gestor",5,"Orden de Pago.","Factura, cuenta de cobro o documento equivalente.","Certificación Bancaria.","Plan de Pagos Actualizado.","Copia de CDR- Certificado de Disponibilidad de Recursos.","Lista de chequeo","Copia del Convenio o Contrato Interadministrativo suscrito por el Gestor y Departamento, junto con sus modificatorios.","Designación del supervisor del Contrato o Convenio, con copia de Cédula y RUT.","Certificación o informe de avance del supervisor del Convenio Interadministrativo o Contrato.","Nota Pago Gestor",null," "," "," "," "," "]
["Pago Gestor Parcial",6,"Orden de Pago.","Factura, cuenta de cobro o documento equivalente.","Plan de Pagos Actualizado.","Copia de CDR- Certificado de Disponibilidad de Recursos.","Lista de chequeo","Certificación o informe de avance del supervisor del Convenio Interadministrativo o Contrato.","Nota Pago Parcial Gestor"]
["Autorización Pago a Terceros",7,"Orden de pago a favor del contratista y Planilla de Autorización de Pago a Terceros.","Factura, cuenta de cobro o documento equivalente.","Certificación Bancaria y documentos del Tercero Autorizado.","Plan de Pagos Actualizado.","Documento soporte Autorización Pago a Tercero","Comunicación de aceptación por parte del Contratante y/o Ordenador del Gasto.","Pre Validador de Retención en la Fuente.","Anexo liquidación Reteicas Múltiples.","Lista de chequeo","Copia de CDR- Certificado de Disponibilidad de Recursos.","Copia de Acta parcial o Certificación de Cumplimiento","Soportes de Pago de Impuesto","Nota Autorización Pago a Tercero","Nota Formalidades de Impuestos","Nota Tarjeta Registro de Firmas"," "," "," "]
["Embargos",8,"Orden de Pago.","Factura, cuenta de cobro o documento equivalente.","Plan de Pagos Actualizado.","Oficio de medida Cautelar o Embargo ","Comunicación del Gestor con los datos de la medida cautelar y Consignación comisión Banco Agrario.","Pre Validador de Retención en la Fuente.","Anexo liquidación Reteicas Múltiples.","Lista de chequeo","Copia de CDR- Certificado de Disponibilidad de Recursos.","Copia de Acta parcial o Certificación de Cumplimiento","Soportes de Pago de Impuesto","Nota Embargos","Nota Formalidades de Impuestos","Nota Tarjeta Registro de Firmas"," "," "]
["Pago de Adquisición de Predios",9,"Orden de Pago.","Factura, cuenta de cobro o documento equivalente.","Certificación Bancaria.","Plan de Pagos Actualizado.","Lista de chequeo","Copia de CDR- Certificado de Disponibilidad de Recursos.","Documentos del beneficiario del pago.","Copia de la Promesa de Compraventa, Contrato, Convenio y/o cualquier otra forma contractual que haya pactado el GESTOR o el FIDEICOMITENTE.","Copia de la Escritura Pública y Certificado de Tradición y Libertad.","Designación de interventor o supervisor de contrato, con copia de Cédula, RUT y Certificado de Existencia y Representación Legal no superior a tres (3) meses o Acuerdo Consorcial / Unión Temporal, según aplique.","Copia de Acta parcial o Certificación de Cumplimiento","Soportes de Pago de Impuesto"," "," "," "," "]
["Pago de Servidumbre",10,"Orden de Pago.","Factura, cuenta de cobro o documento equivalente.","Certificación Bancaria.","Plan de Pagos Actualizado.","Lista de chequeo","Copia de CDR- Certificado de Disponibilidad de Recursos.","Documentos del beneficiario del pago.","Copia de la Promesa de Compraventa, Contrato, Convenio y/o cualquier otra forma contractual que haya pactado el GESTOR o el FIDEICOMITENTE.","Copia de la Escritura Pública y Certificado de Tradición y Libertad.","Designación de interventor o supervisor de contrato, con copia de Cédula, RUT y Certificado de Existencia y Representación Legal no superior a tres (3) meses o Acuerdo Consorcial / Unión Temporal, según aplique.","Copia de Acta parcial o Certificación de Cumplimiento","Soportes de Pago de Impuesto","Nota Servidumbres"," "," "," "]
["Pago de Servicio a la Deuda",11,"Orden de Pago.","Certificación Expedida por el Gestor","Certificación Bancaria","Certificación de Supervisión del Contrato empréstito","Certificado o Visto Bueno del Supervisor del Convenio del Gestor.","Plan de Pagos Actualizado.","Lista de chequeo","Copia de CDR- Certificado de Disponibilidad de Recursos.","Copia del Contrato Empréstito","Documentos del beneficiario del pago","Documentos del Supervisor del Contrato Empréstito","Documentos del Supervisor del Convenio del Gestor"]
["Pago Final",12,"Orden de Pago.","Factura, cuenta de cobro o documento equivalente.","Plan de Pagos Actualizado.","Lista de chequeo","Pre Validador de Retención en la Fuente.","Anexo liquidación Reteicas Múltiples.","Copia de CDR- Certificado de Disponibilidad de Recursos.","Copia del Acta de Final o de Liquidación.","Nota Formalidades de Impuestos","Nota Tarjeta Registro de Firmas",null,null," "," "," "," "]
[{"$nulls":14}," "," "," "," "]
[]
[{"$nulls":14}," "," "," "," "]
[{"$nulls":14}," "," "," ","  "]
[{"$nulls":14}," "," "," "," "]
[{"$nulls":14}," "," "," "," "]
[]
{"$rows_left_out":83}