{"text_format":"2","workbook":"xlsx","n_sheets":4,"sheets":["Plan de Pagos V7","INSTRUCTIVO","LISTADOS","CODI_DANE"],"not_rendered":{"charts":0,"images":8,"macros":0,"external_links":0,"defined_names":41,"comments":1,"pivot_tables":0},"unopened":[],"bounds":{"document_bytes":16777216,"sheet_cells":100000,"run_cost":"one","rows_first":2000,"rows_last":500,"rows_between":2000,"halvings":0,"cell_chars":16384,"cell_head_chars":4096},"cells_cut":0,"cells_raw":0,"read":"whole","date_system":"1900"}

{"sheet":"Plan de Pagos V7","index":0,"n_rows":45,"n_cols":36,"rows_kept":45,"cut":false,"hidden":false,"merged":[[18,0,18,7],[43,0,43,9],[44,0,44,2],[19,2,20,2],[19,1,20,1],[24,4,24,6],[19,9,19,12],[29,5,30,5],[29,6,30,6],[28,0,28,7],[25,5,25,7],[41,0,41,9],[38,0,39,0],[34,4,34,6],[29,7,30,7],[29,2,30,2],[29,17,29,20],[29,13,29,16],[25,21,25,24],[25,25,25,28],[25,9,25,12],[25,13,25,16],[25,17,25,20],[9,1,9,2],[10,1,10,2],[11,1,11,2],[12,1,12,2],[25,29,25,32],[19,13,19,16],[19,29,19,32],[19,6,20,6],[19,7,20,7],[19,21,19,24],[19,25,19,28],[19,17,19,20],[13,1,13,2],[14,1,14,2],[15,1,15,2],[16,3,16,5],[19,0,20,0],[19,3,20,3],[19,4,20,4],[19,5,20,5],[4,0,4,8],[6,3,9,8],[12,7,15,8],[11,7,11,8],[5,3,5,8],[11,3,11,6],[10,3,10,8],[12,3,15,6],[5,1,5,2],[6,1,6,2],[7,1,7,2],[8,0,8,2],[29,1,30,1],[29,0,30,0],[29,3,30,3],[29,4,30,4],[42,0,42,9],[35,5,35,7],[29,9,29,12],[38,1,39,8],[19,35,20,35],[29,33,30,33],[29,34,30,34],[29,35,30,35],[40,9,40,13],[29,21,29,24],[29,25,29,28],[35,9,35,12],[35,13,35,16],[35,29,35,32],[35,21,35,24],[35,25,35,28],[35,17,35,20],[19,33,20,33],[19,34,20,34],[29,29,29,32]]}
[]
[null,"PATRIMONIO AUTÓNOMO FIA"]
[null,"PLAN DE PAGOS "]
["Versión No. 7 / Julio de 2021"]
["PLAN DE PAGOS"]
["PDA",null,null,"OBJETO DEL CONTRATO"]
["Fecha Elaboración",{"$f":"TODAY()","v":"2024-12-04"}]
["No. de Contrato"]
["DATOS DEL CONTRATISTA"]
["Identificación "]
["Nombre Completo",null,null,"FORMATO DE PAGO"]
["Valor contrato inicial",null,null,"CONTRATO INICIAL",null,null,null,"ADICIÓN AL CONTRATO"]
["Valor adición 1"]
["Valor adición 2"]
["Valor adición 3"]
["VALOR TOTAL DEL CONTRATO",{"$f":"SUM(B12:C15)","v":0}]
[null,null,null,"PORCENTAJE DEL ANTICIPO"]
[]
["DETALLE CONTRATO INICIAL"]
["Departamento o municipio","Cód. DANE","No CDR´s","Fecha Expedición CDR","Valor CDR´s  por fuente","Fuente","Código Fuente","Valor contrato por  fuente ","2020-01-01","2020-05-01",null,null,null,"2019-01-01",null,null,null,"2019-02-01",null,null,null,"2019-03-01",null,null,null,"2019-04-01",null,null,null,"2019-05-01",null,null,null,"Total pagos realizados ","Total amortización anticipos","Saldo amortización anticipos"]
[{"$nulls":8},"ANTICIPO","ACTA No 1","Amortización Anticipo","Otros descuentos","NETO","ACTA No 2","Amortización Anticipo","Otros descuentos","NETO","ACTA No 3","Amortización Anticipo","Otros descuentos","NETO","ACTA No 4","Amortización Anticipo","Otros descuentos","NETO","ACTA No 5","Amortización Anticipo","Otros descuentos","NETO","ACTA No 6","Amortización Anticipo","Otros descuentos","NETO"]
[null,{"$f":"IFERROR(VLOOKUP(A22,CODI_DANE!$B$2:$C$1157,2,0),0)","v":0},{"$nulls":4},{"$f":"IFERROR(VLOOKUP(F22,CODI_DANE!$A$1161:$B$1174,2,0),0)","v":0},{"$nulls":5},{"$f":"J22-K22-L22","v":0},null,null,null,{"$f":"N22-O22-P22","v":0},null,0,null,{"$f":"R22-S22-T22","v":0},null,null,null,{"$f":"V22-W22-X22","v":0},null,null,null,{"$f":"Z22-AA22-AB22","v":0},null,null,null,{"$f":"AD22-AE22-AF22","v":0},{"$f":"I22+M22+Q22+AG22+L22+P22+AF22","v":0},{"$f":"K22+O22+AE22","v":0},{"$f":"I22-AI22","v":0}]
[null,{"$f":"IFERROR(VLOOKUP(A23,CODI_DANE!$B$2:$C$1157,2,0),0)","v":0},{"$nulls":4},{"$f":"IFERROR(VLOOKUP(F23,CODI_DANE!$A$1161:$B$1174,2,0),0)","v":0},{"$nulls":5},0,null,null,null,{"$f":"N23-O23-P23","v":0},null,null,null,{"$f":"R23-S23-T23","v":0},null,null,null,{"$f":"V23-W23-X23","v":0},null,null,null,{"$f":"Z23-AA23-AB23","v":0},null,null,null,{"$f":"AD23-AE23-AF23","v":0},{"$f":"I23+M23+Q23+AG23+L23+P23+AF23","v":0},{"$f":"K23+O23+AE23","v":0},{"$f":"I23-AI23","v":0}]
[null,{"$f":"IFERROR(VLOOKUP(A24,CODI_DANE!$B$2:$C$1157,2,0),0)","v":0},{"$nulls":4},{"$f":"IFERROR(VLOOKUP(F24,CODI_DANE!$A$1161:$B$1174,2,0),0)","v":0},{"$nulls":5},{"$f":"J24-K24-L24","v":0},null,null,null,{"$f":"N24-O24-P24","v":0},null,null,null,{"$f":"R24-S24-T24","v":0},null,null,null,{"$f":"V24-W24-X24","v":0},null,null,null,{"$f":"Z24-AA24-AB24","v":0},null,null,null,{"$f":"AD24-AE24-AF24","v":0},{"$f":"I24+M24+Q24+AG24+L24+P24+AF24","v":0},{"$f":"K24+O24+AE24","v":0},{"$f":"I24-AI24","v":0}]
[{"$nulls":4},"TOTAL CONTRATO INICIAL",null,null,{"$f":"SUM(H22:H24)","v":0},{"$f":"SUM(I22:I24)","v":0},{"$f":"SUM(J22:J24)","v":0},{"$f":"SUM(K22:K24)","v":0},{"$f":"SUM(L22:L24)","v":0},0,{"$f":"SUM(N22:N24)","v":0},{"$f":"SUM(O22:O24)","v":0},{"$f":"SUM(P22:P24)","v":0},0,{"$f":"SUM(R22:R24)","v":0},{"$f":"SUM(S22:S24)","v":0},{"$f":"SUM(T22:T24)","v":0},0,{"$f":"SUM(V22:V24)","v":0},{"$f":"SUM(W22:W24)","v":0},{"$f":"SUM(X22:X24)","v":0},0,{"$f":"SUM(Z22:Z24)","v":0},{"$f":"SUM(AA22:AA24)","v":0},{"$f":"SUM(AB22:AB24)","v":0},0,{"$f":"SUM(AD22:AD24)","v":0},{"$f":"SUM(AE22:AE24)","v":0},{"$f":"SUM(AF22:AF24)","v":0},0,{"$f":"SUM(AH22:AH24)","v":0},{"$f":"SUM(AI22:AI24)","v":0},{"$f":"SUM(AJ22:AJ24)","v":0}]
[{"$nulls":5},"SALDO CONTRATO",null,null,{"$f":"H25-I25","v":0},{"$f":"I26-M25-L25","v":0},{"$f":"J25-K25","v":0},0,0,{"$f":"J26-Q25-P25","v":0},{"$f":"N25-O25","v":0},{"$f":"O25-P25","v":0},{"$f":"P25-Q25","v":0},{"$f":"N26-U25-T25","v":0},{"$f":"R25-S25","v":0},{"$f":"S25-T25","v":0},{"$f":"T25-U25","v":0},{"$f":"R26-Y25-X25","v":0},{"$f":"V25-W25","v":0},{"$f":"W25-X25","v":0},{"$f":"X25-Y25","v":0},{"$f":"V26-AC25-AB25","v":0},{"$f":"Z25-AA25","v":0},{"$f":"AA25-AB25","v":0},{"$f":"AB25-AC25","v":0},{"$f":"Z26-AG25-AF25","v":0},{"$f":"AD25-AE25","v":0},{"$f":"AE25-AF25","v":0},{"$f":"AF25-AG25","v":0}]
[]
[]
["DETALLE ADICIONES AL CONTRATO"]
["Departamento o municipio","Cód. DANE","No CDR´s","Fecha Expedición CDR","Valor CDR´s  por fuente","Fuente","Código Fuente","Valor contrato por  fuente ","MES - AÑO","2018-12-01",null,null,null,"2019-01-01",null,null,null,"2019-02-01",null,null,null,"2019-03-01",null,null,null,"2019-04-01",null,null,null,"2019-05-01",null,null,null,"Total pagos realizados ","Total amortización anticipos","Saldo amortización anticipos"]
{"$rows_left_out":16}
{"sheet":"INSTRUCTIVO","index":1,"n_rows":51,"n_cols":10,"rows_kept":51,"cut":false,"hidden":false,"merged":[[58,4,58,5],[1,1,1,13],[5,7,5,14],[50,2,52,4],[11,7,11,11],[31,1,32,5],[31,7,33,9],[41,5,41,9],[50,5,52,8],[50,9,52,9],[4,7,4,10],[6,7,6,10],[8,7,8,11],[9,7,9,11],[10,7,10,11]]}
[]
[null,"INSTRUCTIVO DILIGENCIAMIENTO PLAN DE PAGOS"]
[]
[]
[{"$nulls":7},"Despliegue la lista y escoja el PDA (Departamento)."]
[{"$nulls":7},"Fecha de actualización del plan de pagos. (Fecha actual en la cual se esta presentando el pago para trámite)"]
[{"$nulls":7},"Número de contrato, se debe digitar completo incluyendo año y letras si aplica."]
[]
[{"$nulls":7},"Número de Nit o documento de identificación de contratista"]
[{"$nulls":7},"Nombre completo de contratista"]
[{"$nulls":7},"Valor en números contrato inicial "]
[{"$nulls":7},"Valor en números contrato de adición"]
[]
[]
[{"$nulls":7},"La suma de contrato inicial mas adiciones."]
[]
[]
[]
[]
[]
[{"$nulls":9},"Digitar el objeto del contrato a pagar, tal como se evidencia en el documento contractual."]
{"$rows_empty":10}
[null,"Digitar  la cláusula y el detalle de forma de pago conforme a lo establecido en el contrato inicial.",{"$nulls":5},"Digitar el detalle de forma de pago conforme a lo establecido en el contrato de adición, en los casos que aplique"]
{"$rows_empty":9}
[{"$nulls":5},"Se debe generar un registro por cada CDR y fuente se utilice"]
{"$rows_empty":8}
[null,null,"Departamento o municipio que financiara el contrato, siempre debe incluir nombre y código DANE.",null,null,"Digite el número de CDR expedido para amparar el contrato, fecha (el mes siempre debe venir en letras) y valor ",null,null,null,"Seleccionar fuente de acuerdo a CDR"]

{"sheet":"LISTADOS","index":2,"n_rows":126,"n_cols":36,"rows_kept":126,"cut":false,"hidden":true,"merged":[]}
["DEPARTAMENTO","AMAZONAS","ANTIOQUIA","ARAUCA","ATLÁNTICO","BOLÍVAR","BOYACÁ","CALDAS","CAQUETÁ","CASANARE","CAUCA","CESAR","CHOCÓ","CÓRDOBA","CUNDINAMARCA","GUAINÍA","GUAVIARE","HUILA","LA_GUAJIRA","MAGDALENA","META","NARIÑO","PDA_NEIVA","NORTE_DE_SANTANDER","PUTUMAYO","QUINDIO","RISARALDA","SAN_ANDRÉS","SANTANDER","SUCRE","TOLIMA","VALLE_DEL_CAUCA","VAUPÉS","VICHADA","AGUAS_DE_MAGDALENA","AGUAS_DE_BOLÍVAR"]
["AMAZONAS","EL ENCANTO","ABEJORRAL","ARAUCA - DEPARTAMENTO","ATLANTICO","ACHI","ALMEIDA","AGUADAS","ALBANIA - CAQUETA","AGUAZUL","ALMAGUER","AGUACHICA","ACANDI","AYAPEL","AGUA DE DIOS","BARRANCO MINAS","CALAMAR - GUAVIARE","ACEVEDO","ALBANIA - LA GUAJIRA","ALGARROBO","ACACIAS","ALBAN - NARIÑO","NEIVA","ABREGO","COLON - PUTUMAYO","ARMENIA - QUINDIO","APIA","PROVIDENCIA - SAN ANDRES","AGUADA","BUENAVISTA","ALPUJARRA","ALCALA","CARURU","CUMARIBO","AGUAS DE MAGDALENA","AGUAS DE BOLÍVAR"]
["ANTIOQUIA","LA CHORRERA","ABRIAQUI","ARAUCA - MUNICIPIO","BARANOA","ALTOS DEL ROSARIO","AQUITANIA","ANSERMA","BELEN DE LOS ANDAQUIES","CASANARE","ARGELIA - CAUCA","AGUSTIN CODAZZI","ALTO BAUDO","BUENAVISTA - CORDOBA","ALBAN - CUNDINAMARCA","CACAHUAL","EL RETORNO","AGRADO","BARRANCAS","ARACATACA","BARRANCA DE UPIA","ALDANA",null,"ARBOLEDAS","LEGUIZAMO","BUENAVISTA - QUINDIO","BALBOA - RISARALDA","SAN ANDRES - MUNICIPIO","ALBANIA - SANTANDER","CAIMITO","ALVARADO","ANDALUCIA","MITU","LA PRIMAVERA"]
["ARAUCA","LA PEDRERA","ALEJANDRIA","ARAUQUITA","BARRANQUILLA","ARENAL","ARCABUCO","ARANZAZU","CAQUETA","CHAMEZA","BALBOA - CAUCA","ASTREA","ATRATO","CANALETE","ANAPOIMA","GUAINIA","GUAVIARE","AIPE","DIBULLA","ARIGUANI","CABUYARO","ANCUYA",null,"BOCHALEMA","MOCOA","CALARCA","BELEN DE UMBRIA","SAN ANDRES - DPTO.","ARATOCA","CHALAN","AMBALEMA","ANSERMANUEVO","PACOA","PUERTO CARREÑO"]
["ATLÁNTICO","LA VICTORIA - AMAZONAS","AMAGA","CRAVO NORTE","CAMPO DE LA CRUZ","ARJONA","BELEN - BOYACA","BELALCAZAR","CARTAGENA DEL CHAIRA","HATO COROZAL","BOLIVAR - CAUCA","BECERRIL","BAGADO","CERETE","ANOLAIMA","INIRIDA","MIRAFLORES - GUAVIARE","ALGECIRAS","DISTRACCION","CERRO SAN ANTONIO","CASTILLA LA NUEVA","ARBOLEDA",null,"BUCARASICA","ORITO","CIRCASIA","DOSQUEBRADAS",null,"BARBOSA - SANTANDER","COLOSO","ANZOATEGUI","ARGELIA","PAPUNAUA","SANTA ROSALIA"]
["BOLÍVAR","LETICIA","AMALFI","FORTUL","CANDELARIA - ATLANTICO","ARROYOHONDO","BERBEO","CALDAS -DPTO.","CURILLO","LA SALINA","BUENOS AIRES","BOSCONIA","BAHIA SOLANO","CHIMA - CORDOBA","APULO","LA GUADALUPE","SAN JOSE DEL GUAVIARE","ALTAMIRA","EL MOLINO","CHIBOLO","CUBARRAL","BARBACOAS",null,"CACHIRA","PUERTO ASIS","CORDOBA - QUINDIO","GUATICA",null,"BARICHARA","COROZAL","ARMERO","BOLIVAR - VALLE DEL CAUCA","TARAIRA","SANTA ROSALÍA"]
["BOYACÁ","MIRITI - PARANA","ANDES","PUERTO RONDON","GALAPA","BARRANCO DE LOBA","BETEITIVA","CHINCHINA","EL DONCELLO","MANI","CAJIBIO","CESAR","BAJO BAUDO","CHINU","ARBELAEZ","MAPIRIPANA",null,"BARAYA","FONSECA","CIENAGA","CUMARAL","BELEN - NARIÑO",null,"CACOTA","PUERTO CAICEDO","FILANDIA","LA CELIA",null,"BARRANCABERMEJA","COVEÑAS","ATACO","BUENAVENTURA","VAUPES","VICHADA"]
["CALDAS","PUERTO ALEGRIA","ANGELOPOLIS","SARAVENA","JUAN DE ACOSTA","BOLIVAR","BOAVITA","FILADELFIA","EL PAUJIL","MONTERREY","CALDONO","CHIMICHAGUA","BOJAYA","CIENAGA DE ORO","BELTRAN","MORICHAL",null,"CAMPOALEGRE","HATONUEVO","CONCORDIA - MAGDALENA","EL CALVARIO","BUESACO",null,"CHINACOTA","PUERTO GUZMAN","GENOVA","LA VIRGINIA",null,"BETULIA - SANTANDER","EL ROBLE","CAJAMARCA","BUGALAGRANDE","YAVARATE"]
["CAQUETÁ","PUERTO ARICA","ANGOSTURA","TAME","LURUACO","CALAMAR - BOLIVAR","BOYACA - MUNICIPIO","LA DORADA","FLORENCIA - CAQUETA","NUNCHIA","CALOTO","CHIRIGUANA","CARMEN DEL DARIEN","CORDOBA","BITUIMA","PANA PANA",null,"COLOMBIA","LA GUAJIRA","EL BANCO","EL CASTILLO","CHACHAGsI",null,"CHITAGA","PUTUMAYO","LA TEBAIDA","MARSELLA",null,"BOLIVAR - SANTANDER","GALERAS","CARMEN DE APICALA","CAICEDONIA"]
["CASANARE","PUERTO NARIÑO","ANORI",null,"MALAMBO","CANTAGALLO","BOYACA-  DEPARTAMENTO","LA MERCED","LA MONTAÑITA","OROCUE","CAUCA","CURUMANI","CERTEGUI","COTORRA","BOJACA","PUERTO COLOMBIA - GUAINIA",null,"ELIAS","LA JAGUA DEL PILAR","EL PIÑON","EL DORADO","COLON - NARIÑO",null,"CONVENCION","SAN FRANCISCO - PUTUMAYO","MONTENEGRO","MISTRATO",null,"BUCARAMANGA","GUARANDA","CASABIANCA","CALI"]
["CAUCA","PUERTO SANTANDER - AMAZONAS","ANZA",null,"MANATI","CARTAGENA","BRICEÑO - BOYACA","MANIZALES","MILAN","PAZ DE ARIPORO","CORINTO","EL COPEY","CHOCO","LA APARTADA","CABRERA - CUNDINAMARCA","SAN FELIPE",null,"GARZON","MAICAO","EL RETEN","FUENTE DE ORO","CONSACA",null,"CUCUTA","SAN MIGUEL - PUTUMAYO","PIJAO","PEREIRA",null,"CABRERA - SANTANDER","LA UNION - SUCRE","CHAPARRAL","CALIMA"]
["CESAR","TARAPACA","APARTADO",null,"PALMAR DE VARELA","CICUCO","BUENAVISTA - BOYACA","MANZANARES","MORELIA","PORE","EL TAMBO - CAUCA","EL PASO","CONDOTO","LORICA","CACHIPAY",null,null,"GIGANTE","MANAURE - LA GUAJIRA","FUNDACION","GRANADA","CONTADERO",null,"CUCUTILLA","SANTIAGO - PUTUMAYO","QUIMBAYA","PUEBLO RICO",null,"CALIFORNIA","LOS PALMITOS","COELLO","CANDELARIA"]
["CHOCÓ",null,"ARBOLETES",null,"PIOJO","CLEMENCIA","BUSBANZA","MARMATO","PUERTO RICO - CAQUETA","RECETOR","FLORENCIA - CAUCA","GAMARRA","EL CANTON DEL SAN PABLO","LOS CORDOBAS","CAJICA",null,null,"GUADALUPE - HUILA","RIOHACHA","GUAMAL - MAGDALENA","GUAMAL - META","CORDOBA - NARIÑO",null,"DURANIA","SIBUNDOY","QUINDIO","QUINCHIA",null,"CAPITANEJO","MAJAGUAL","COYAIMA","CARTAGO"]
["CÓRDOBA",null,"ARGELIA - ANTIOQUIA",null,"POLONUEVO","CORDOBA - BOLIVAR","CALDAS - BOYACA","MARQUETALIA","SAN JOSE DEL FRAGUA","SABANALARGA","GUACHENE","GONZALEZ","EL CARMEN DE ATRATO","MOMIL","CAPARRAPI",null,null,"HOBO","SAN JUAN DEL CESAR","MAGDALENA","LA MACARENA","CUASPUD",null,"EL CARMEN","VALLE DEL GUAMUEZ","SALENTO","RISARALDA - RISARALDA",null,"CARCASI","MORROA","CUNDAY","DAGUA"]
["CUNDINAMARCA",null,"ARMENIA - ANTIOQUIA",null,"PONEDERA","EL CARMEN DE BOLIVAR","CAMPOHERMOSO","MARULANDA","SAN VICENTE DEL CAGUAN","SACAMA","GUAPI","LA GLORIA","EL LITORAL DEL SAN JUAN","MONTELIBANO","CAQUEZA",null,null,"HUILA","URIBIA","NUEVA GRANADA","LEJANIAS","CUMBAL",null,"EL TARRA","VILLAGARZON",null,"SANTA ROSA DE CABAL",null,"CEPITA","OVEJAS","DOLORES","EL AGUILA"]
["GUAINÍA",null,"BARBOSA - ANTIOQUIA",null,"PUERTO COLOMBIA - ATLANTICO","EL GUAMO","CERINZA","NEIRA","SOLANO","SAN LUIS DE PALENQUE","INZA","LA JAGUA DE IBIRICO","ISTMINA","MONTERIA","CARMEN DE CARUPA",null,null,"IQUIRA","URUMITA","PEDRAZA","MAPIRIPAN","CUMBITARA",null,"EL ZULIA",null,null,"SANTUARIO",null,"CERRITO","PALMITO","ESPINAL","EL CAIRO"]
["GUAVIARE",null,"BELLO",null,"REPELON","EL PEÑON - BOLIVAR","CHINAVITA","NORCASIA","SOLITA","TAMARA","JAMBALO","LA PAZ - CESAR","JURADO","MOÑITOS","CHAGUANI",null,null,"ISNOS","VILLANUEVA - LA GUAJIRA","PIJIÑO DEL CARMEN","MESETAS","EL CHARCO",null,"GRAMALOTE",{"$nulls":4},"CHARALA","SAMPUES","FALAN","EL CERRITO"]
["HUILA",null,"BELMIRA",null,"SABANAGRANDE","HATILLO DE LOBA","CHIQUINQUIRA","PACORA","VALPARAISO","TAURAMENA","LA SIERRA","MANAURE - CESAR","LLORO","PLANETA RICA","CHIA",null,null,"LA ARGENTINA",null,"PIVIJAY","META","EL PEÑOL",null,"HACARI",{"$nulls":4},"CHARTA","SAN BENITO ABAD","FLANDES","EL DOVIO"]
["LA_GUAJIRA",null,"BETANIA",null,"SABANALARGA - ATLANTICO","MAGANGUE","CHIQUIZA","PALESTINA - CALDAS",null,"TRINIDAD","LA VEGA - CAUCA","PAILITAS","MEDIO ATRATO","PUEBLO NUEVO","CHIPAQUE",null,null,"LA PLATA",null,"PLATO","PUERTO CONCORDIA","EL ROSARIO",null,"HERRAN",{"$nulls":4},"CHIMA - SANTANDER","SAN JUAN DE BETULIA","FRESNO","FLORIDA"]
["MAGDALENA",null,"BETULIA - ANTIOQUIA",null,"SANTA LUCIA","MAHATES","CHISCAS","PENSILVANIA",null,"VILLANUEVA","LOPEZ","PELAYA","MEDIO BAUDO","PUERTO ESCONDIDO","CHOACHI",null,null,"NATAGA",null,"PUEBLOVIEJO","PUERTO GAITAN","EL TABLON DE GOMEZ",null,"LA ESPERANZA",{"$nulls":4},"CHIPATA","SAN LUIS DE SINCE","GUAMO","GINEBRA"]
["META",null,"BRICEÑO - ANTIOQUIA",null,"SANTO TOMAS","MARGARITA","CHITA","RIOSUCIO",null,"YOPAL","MERCADERES","PUEBLO BELLO","MEDIO SAN JUAN","PUERTO LIBERTADOR","CHOCONTA",null,null,"NEIVA",null,"REMOLINO","PUERTO LLERAS","EL TAMBO - NARIÑO",null,"LA PLAYA",{"$nulls":4},"CIMITARRA","SAN MARCOS","HERVEO","GUACARI"]
["NARIÑO",null,"BURITICA",null,"SOLEDAD","MARIA LA BAJA","CHITARAQUE","RISARALDA - CALDAS",null,null,"MIRANDA","RIO DE ORO","NOVITA","PURISIMA","COGUA",null,null,"OPORAPA",null,"SABANAS DE SAN ANGEL","PUERTO LOPEZ","FRANCISCO PIZARRO",null,"LABATECA",{"$nulls":4},"CONCEPCION - SANTANDER","SAN ONOFRE","HONDA","GUADALAJARA DE BUGA"]
["PDA_NEIVA",null,"CACERES",null,"SUAN","MOMPOS","CHIVATA","SALAMINA - CALDAS",null,null,"MORALES - CAUCA","SAN ALBERTO","NUQUI","SAHAGUN","COTA",null,null,"PAICOL",null,"SALAMINA - MAGDALENA","PUERTO RICO - META","FUNES",null,"LOS PATIOS",{"$nulls":4},"CONFINES","SAN PEDRO - SUCRE","IBAGUE","JAMUNDI"]
["NORTE_DE_SANTANDER",null,"CAICEDO",null,"TUBARA","MONTECRISTO","CHIVOR","SAMANA",null,null,"PADILLA","SAN DIEGO","QUIBDO","SAN ANDRES SOTAVENTO","CUCUNUBA",null,null,"PALERMO",null,"SAN SEBASTIAN DE BUENAVISTA","RESTREPO - META","GUACHUCAL",null,"LOURDES",{"$nulls":4},"CONTRATACION","SANTIAGO DE TOLU","ICONONZO","LA CUMBRE"]
["PUTUMAYO",null,"CALDAS - ANTIOQUIA",null,"USIACURI","MORALES - BOLIVAR","CIENEGA","SAN JOSE",null,null,"PAEZ - CAUCA","SAN MARTIN - CESAR","RIO IRO","SAN ANTERO","CUNDINAMARCA",null,null,"PALESTINA - HUILA",null,"SAN ZENON","SAN CARLOS DE GUAROA","GUAITARILLA",null,"MUTISCUA",{"$nulls":4},"COROMORO","SINCELEJO","LERIDA","LA UNION - VALLE DEL CAUCA"]
["QUINDIO",null,"CAMPAMENTO",null,null,"NOROSI","COMBITA","SUPIA",null,null,"PATIA","TAMALAMEQUE","RIO QUITO","SAN BERNARDO DEL VIENTO","EL COLEGIO",null,null,"PITAL",null,"SANTA ANA","SAN JUAN DE ARAMA","GUALMATAN",null,"NORTE DE SANTANDER",{"$nulls":4},"CURITI","SUCRE - MUNICIPIO","LIBANO","LA VICTORIA - VALLE DEL CAUCA"]
["RISARALDA",null,"CAÑASGORDAS",null,null,"PINILLOS","COPER","VICTORIA",null,null,"PIAMONTE","VALLEDUPAR","RIOSUCIO","SAN CARLOS - CORDOBA","EL PEÑON - CUNDINAMARCA",null,null,"PITALITO",null,"SANTA BARBARA DE PINTO","SAN JUANITO","ILES",null,"OCAÑA",{"$nulls":4},"EL CARMEN DE CHUCURI","SUCRE - DPTO.","MARIQUITA","OBANDO"]
["SAN_ANDRÉS",null,"CARACOLI",null,null,"REGIDOR","CORRALES","VILLAMARIA",null,null,"PIENDAMO",null,"SAN JOSE DEL PALMAR","SAN PELAYO","EL ROSAL",null,null,"RIVERA",null,"SANTA MARTA","SAN MARTIN - META","IMUES",null,"PAMPLONA",{"$nulls":4},"EL GUACAMAYO","TOLU VIEJO","MELGAR","PALMIRA"]
["SANTANDER",null,"CARAMANTA",null,null,"RIO VIEJO","COVARACHIA","VITERBO",null,null,"POPAYAN",null,"SIPI","TIERRALTA","FACATATIVA",null,null,"SALADOBLANCO",null,"SITIONUEVO","URIBE","IPIALES",null,"PAMPLONITA",{"$nulls":4},"EL PEÑON",null,"MURILLO","PRADERA"]
["SUCRE",null,"CAREPA",null,null,"SAN CRISTOBAL","CUBARA",null,null,null,"PUERTO TEJADA",null,"TADO","VALENCIA","FOMEQUE",null,null,"SAN AGUSTIN",null,"TENERIFE","VILLAVICENCIO","LA CRUZ",null,"PUERTO SANTANDER - NTE SANTANDER",{"$nulls":4},"EL PLAYON",null,"NATAGAIMA","RESTREPO - VALLE DEL CAUCA"]
{"$rows_left_out":97}
{"sheet":"CODI_DANE","index":3,"n_rows":1174,"n_cols":9,"rows_kept":1174,"cut":false,"hidden":true,"merged":[]}
["Nombre Departamento","Nombre Municipio","Código\nMunicipio",null,null,null,"PAP-PDA"]
["ANTIOQUIA","ABEJORRAL",5002,false,null,"AMAZONAS","AMAZONAS",91000,{"$f":"CONCATENATE(\"PAP-PDA - \",VLOOKUP('Plan de Pagos V7'!$B$6,$F$2:$H$34,3,))","v":{"$error":"#N/A"}}]
["N. DE SANTANDER","ABREGO",54003,false,null,"ANTIOQUIA","ANTIOQUIA",5000]
["ANTIOQUIA","ABRIAQUI",5004,false,null,"ARAUCA","ARAUCA",8100]
["META","ACACIAS",50006,false,null,"ATLÁNTICO","ATLÁNTICO",8000]
["CHOCO","ACANDI",27006,false,null,"BOLÍVAR","BOLÍVAR",13000]
["HUILA","ACEVEDO",41006,false,null,"BOYACÁ","BOYACA",15000]
["BOLIVAR","ACHI",13006,false,null,"CALDAS","CALDAS",17000]
["HUILA","AGRADO",41013,false,null,"CAQUETÁ","CAQUETA",18000]
["CUNDINAMARCA","AGUA DE DIOS",25001,false,null,"CASANARE","CASANARE",85000]
["CESAR","AGUACHICA",20011,false,null,"CAUCA","CAUCA",19000]
["SANTANDER","AGUADA",68013,false,null,"CESAR","CESAR",20999]
["CALDAS","AGUADAS",17013,false,null,"CHOCÓ","CHOCÓ",27000]
["CASANARE","AGUAZUL",85010,false,null,"CÓRDOBA","CÓRDOBA",23000]
["CESAR","AGUSTIN CODAZZI",20013,false,null,"CUNDINAMARCA","CUNDINAMARCA",25000]
["HUILA","AIPE",41016,false,null,"GUAINÍA","GUAINÍA",94000]
["CUNDINAMARCA","ALBAN - CUNDINAMARCA",25019,false,null,"GUAVIARE","GUAVIARE",95000]
["NARIÑO","ALBAN - NARIÑO",52019,false,null,"HUILA","HUILA",41000]
["CAQUETA","ALBANIA - CAQUETA",18029,false,null,"PDA_NEIVA","PDA NEIVA",41001]
["LA GUAJIRA","ALBANIA - LA GUAJIRA",44035,false,null,"LA GUAJIRA","GUAJIRA",44000]
["SANTANDER","ALBANIA - SANTANDER",68020,false,null,"MAGDALENA","MAGDALENA ",47000]
["VALLE DEL CAUCA","ALCALA",76020,false,null,"META","META",50000]
["NARIÑO","ALDANA",52022,false,null,"NARIÑO","NARIÑO",52000]
["ANTIOQUIA","ALEJANDRIA",5021,false,null,"NORTE_DE_SANTANDER","NORTE DE SANTANDER",54000]
["MAGDALENA","ALGARROBO",47030,false,null,"PUTUMAYO","PUTUMAYO ",86000]
["HUILA","ALGECIRAS",41020,false,null,"QUINDIO","QUINDÍO",63000]
["CAUCA","ALMAGUER",19022,false,null,"RISARALDA","RISARALDA",66000]
["BOYACA","ALMEIDA",15022,false,null,"SAN_ANDRÉS","SAN ANDRÉS",88000]
["TOLIMA","ALPUJARRA",73024,false,null,"SANTANDER","SANTANDER",68000]
["HUILA","ALTAMIRA",41026,false,null,"SUCRE","SUCRE",70000]
{"$rows_left_out":1144}