{"text_format":"2","workbook":"xlsx","n_sheets":4,"sheets":["Programación de pagos","INSTRUCTIVO","LISTADOS","CODI_DANE"],"not_rendered":{"charts":0,"images":8,"macros":0,"external_links":0,"defined_names":39,"comments":1,"pivot_tables":0},"unopened":[],"bounds":{"document_bytes":16777216,"sheet_cells":100000,"run_cost":"one","rows_first":2000,"rows_last":500,"rows_between":2000,"halvings":0,"cell_chars":16384,"cell_head_chars":4096},"cells_cut":0,"cells_raw":0,"read":"whole","date_system":"1900"}

{"sheet":"Programación de pagos","index":0,"n_rows":42,"n_cols":38,"rows_kept":42,"cut":false,"hidden":false,"merged":[[19,37,20,37],[29,35,30,35],[29,36,30,36],[29,37,30,37],[40,11,40,15],[29,23,29,26],[29,27,29,30],[35,7,35,9],[31,3,31,4],[41,0,41,11],[19,35,20,35],[19,36,20,36],[19,0,20,0],[19,5,20,5],[19,6,20,6],[19,7,20,7],[38,0,39,0],[34,6,34,8],[29,9,30,9],[29,3,30,4],[38,1,39,10],[29,1,30,2],[4,0,4,10],[6,5,9,10],[12,9,15,10],[11,9,11,10],[5,5,5,10],[11,5,11,8],[10,5,10,10],[12,5,15,8],[5,1,5,4],[6,1,6,4],[7,1,7,4],[8,0,8,4],[29,0,30,0],[29,5,30,5],[29,6,30,6],[29,7,30,7],[29,8,30,8],[25,31,25,34],[24,6,24,8],[25,7,25,9],[19,11,19,14],[19,15,19,18],[19,31,19,34],[19,8,20,8],[19,9,20,9],[19,23,19,26],[25,23,25,26],[19,27,19,30],[25,27,25,30],[25,11,25,14],[25,15,25,18],[19,19,19,22],[25,19,25,22],[29,31,29,34],[35,11,35,14],[35,15,35,18],[35,31,35,34],[29,11,29,14],[35,23,35,26],[35,27,35,30],[29,19,29,22],[35,19,35,22],[29,15,29,18],[32,3,32,4],[33,3,33,4],[31,1,31,2],[32,1,32,2],[33,1,33,2],[9,1,9,4],[10,1,10,4],[11,1,11,4],[12,1,12,4],[13,1,13,4],[14,1,14,4],[15,1,15,4],[16,5,16,7],[18,0,18,9],[28,0,28,9],[22,1,22,2],[22,3,22,4],[19,3,20,4],[21,3,21,4],[23,3,23,4],[19,1,20,2],[21,1,21,2],[23,1,23,2]]}
[]
[null,"PATRIMONIO AUTÓNOMO FIA"]
[null,"PROGRAMACIÓN DE PAGOS "]
[]
["PROGRAMACIÓN DE PAGOS"]
["PAP-PDA","SANTANDER",null,null,null,"OBJETO DEL CONTRATO"]
["Fecha","2019-05-08"]
["No. de Contrato"]
["DATOS DEL CONTRATISTA"]
["Identificación "]
["Nombre Completo",{"$nulls":4},"FORMATO DE PAGO"]
["Valor contrato inicial",{"$nulls":4},"CONTRATO INICIAL",null,null,null,"ADICIÓN AL CONTRATO"]
["Valor adición 1"]
["Valor adición 2"]
["Valor adición 3"]
["VALOR TOTAL DEL CONTRATO",{"$f":"SUM(B12:E15)","v":0}]
[{"$nulls":5},"PORCENTAJE DEL ANTICIPO"]
[]
["DETALLE CONTRATO INICIAL"]
["Departamento o municipio","Cod DANE",null,"No CDR´s",null,"Fecha Expedición CDR","Valor CDR´s  por fuente","Fuente","Codigo Fuente","Valor contrato por  fuente ","MES - AÑO","2018-12-01",null,null,null,"2019-01-01",null,null,null,"2019-02-01",null,null,null,"2019-03-01",null,null,null,"2019-04-01",null,null,null,"2019-05-01",null,null,null,"Total pagos realizados ","Total amortización anticipos","Saldo amortización anticipos"]
[{"$nulls":10},"ANTICIPO","ACTA No 1","Amortización Anticipo","Otros descuentos","NETO","ACTA No 2","Amortización Anticipo","Otros descuentos","NETO","ACTA No 3","Amortización Anticipo","Otros descuentos","NETO","ACTA No 4","Amortización Anticipo","Otros descuentos","NETO","ACTA No 5","Amortización Anticipo","Otros descuentos","NETO","ACTA No 6","Amortización Anticipo","Otros descuentos","NETO"]
[null,{"$f":"IFERROR(VLOOKUP(A22,CODI_DANE!$B$2:$C$1155,2,0),0)","v":0},{"$nulls":5},"SGP",{"$f":"IFERROR(VLOOKUP(H22,CODI_DANE!$A$1161:$B$1172,2,0),0)","v":103},500000000,150000000,125000000,75000000,null,{"$f":"L22-M22-N22","v":50000000},80000000,75000000,null,{"$f":"P22-Q22-R22","v":5000000},null,0,null,{"$f":"T22-U22-V22","v":0},null,null,null,{"$f":"X22-Y22-Z22","v":0},null,null,null,{"$f":"AB22-AC22-AD22","v":0},null,null,null,{"$f":"AF22-AG22-AH22","v":0},{"$f":"K22+O22+S22+AI22+N22+R22+AH22","v":205000000},{"$f":"M22+Q22+AG22","v":150000000},{"$f":"K22-AK22","v":0}]
[null,{"$f":"IFERROR(VLOOKUP(A23,CODI_DANE!$B$2:$C$1155,2,0),0)","v":0},{"$nulls":5},"RECURSOS DE LA NACION /AUDIENCIAS PUBLICAS",{"$f":"IFERROR(VLOOKUP(H23,CODI_DANE!$A$1161:$B$1172,2,0),0)","v":105},250000000,100000000,50000000,25000000,null,{"$f":"L23-M23-N23","v":25000000},100000000,25000000,null,{"$f":"P23-Q23-R23","v":75000000},null,null,null,{"$f":"T23-U23-V23","v":0},null,null,null,{"$f":"X23-Y23-Z23","v":0},null,null,null,{"$f":"AB23-AC23-AD23","v":0},null,null,null,{"$f":"AF23-AG23-AH23","v":0},{"$f":"K23+O23+S23+AI23+N23+R23+AH23","v":200000000},{"$f":"M23+Q23+AG23","v":50000000},{"$f":"K23-AK23","v":50000000}]
[null,{"$f":"IFERROR(VLOOKUP(A24,CODI_DANE!$B$2:$C$1155,2,0),0)","v":0},{"$nulls":5},"REGALIAS -FONDO COMPENSACION REGIONAL ",{"$f":"IFERROR(VLOOKUP(H24,CODI_DANE!$A$1161:$B$1172,2,0),0)","v":118},{"$nulls":5},{"$f":"L24-M24-N24","v":0},null,null,null,{"$f":"P24-Q24-R24","v":0},null,null,null,{"$f":"T24-U24-V24","v":0},null,null,null,{"$f":"X24-Y24-Z24","v":0},null,null,null,{"$f":"AB24-AC24-AD24","v":0},null,null,null,{"$f":"AF24-AG24-AH24","v":0},{"$f":"K24+O24+S24+AI24+N24+R24+AH24","v":0},{"$f":"M24+Q24+AG24","v":0},{"$f":"K24-AK24","v":0}]
[{"$nulls":6},"TOTAL CONTRATO INICIAL",null,null,{"$f":"SUM(J22:J24)","v":750000000},{"$f":"SUM(K22:K24)","v":250000000},{"$f":"SUM(L22:L24)","v":175000000},{"$f":"SUM(M22:M24)","v":100000000},{"$f":"SUM(N22:N24)","v":0},75000000,{"$f":"SUM(P22:P24)","v":180000000},{"$f":"SUM(Q22:Q24)","v":100000000},{"$f":"SUM(R22:R24)","v":0},80000000,{"$f":"SUM(T22:T24)","v":0},{"$f":"SUM(U22:U24)","v":0},{"$f":"SUM(V22:V24)","v":0},0,{"$f":"SUM(X22:X24)","v":0},{"$f":"SUM(Y22:Y24)","v":0},{"$f":"SUM(Z22:Z24)","v":0},0,{"$f":"SUM(AB22:AB24)","v":0},{"$f":"SUM(AC22:AC24)","v":0},{"$f":"SUM(AD22:AD24)","v":0},0,{"$f":"SUM(AF22:AF24)","v":0},{"$f":"SUM(AG22:AG24)","v":0},{"$f":"SUM(AH22:AH24)","v":0},0,{"$f":"SUM(AJ22:AJ24)","v":405000000},{"$f":"SUM(AK22:AK24)","v":200000000},{"$f":"SUM(AL22:AL24)","v":50000000}]
[{"$nulls":7},"SALDO CONTRATO",null,null,{"$f":"J25-K25","v":500000000},{"$f":"K26-O25-N25","v":425000000},{"$f":"L25-M25","v":75000000},100000000,-75000000,{"$f":"L26-S25-R25","v":345000000},{"$f":"P25-Q25","v":80000000},{"$f":"Q25-R25","v":100000000},{"$f":"R25-S25","v":-80000000},{"$f":"P26-W25-V25","v":345000000},{"$f":"T25-U25","v":0},{"$f":"U25-V25","v":0},{"$f":"V25-W25","v":0},{"$f":"T26-AA25-Z25","v":345000000},{"$f":"X25-Y25","v":0},{"$f":"Y25-Z25","v":0},{"$f":"Z25-AA25","v":0},{"$f":"X26-AE25-AD25","v":345000000},{"$f":"AB25-AC25","v":0},{"$f":"AC25-AD25","v":0},{"$f":"AD25-AE25","v":0},{"$f":"AB26-AI25-AH25","v":345000000},{"$f":"AF25-AG25","v":0},{"$f":"AG25-AH25","v":0},{"$f":"AH25-AI25","v":0}]
[]
[]
["DETALLE ADICIONES AL CONTRATO"]
["Departamento o municipio","Cod DANE",null,"No CDR´s",null,"Fecha Expedición CDR","Valor CDR´s  por fuente","Fuente","Codigo Fuente","Valor contrato por  fuente ","MES - AÑO","2018-12-01",null,null,null,"2019-01-01",null,null,null,"2019-02-01",null,null,null,"2019-03-01",null,null,null,"2019-04-01",null,null,null,"2019-05-01",null,null,null,"Total pagos realizados ","Total amortización anticipos","Saldo amortización anticipos"]
{"$rows_left_out":13}
{"sheet":"INSTRUCTIVO","index":1,"n_rows":47,"n_cols":10,"rows_kept":47,"cut":false,"hidden":false,"merged":[[54,3,54,4],[2,6,2,9],[3,6,3,9],[4,6,4,9],[6,6,6,10],[7,6,7,10],[8,6,8,10],[46,4,48,7],[46,8,48,8],[28,0,29,4],[28,6,30,8],[9,6,9,10],[38,4,38,8],[46,2,48,3]]}
[]
[]
[{"$nulls":6},"Despliegue la lista y escoja el PDA (Departamento)."]
[{"$nulls":6},"Fecha de actualización del plan de pagos. (Fecha actual en la cual se esta presentando el pago para trámite)"]
[{"$nulls":6},"Número de contrato"]
[]
[{"$nulls":6},"Número de Nit o documento de identificación de contratista"]
[{"$nulls":6},"Nombre completo de contratista"]
[{"$nulls":6},"Valor en números contrato inicial "]
[{"$nulls":6},"Valor en números contrato de adición"]
[]
[]
[{"$nulls":6},"La suma de contrato inicila mas adiciones."]
[]
[]
[]
[]
[{"$nulls":9},"Digitar el objeto del contrato a pagar, tal como se evidencia en el documento contractual."]
{"$rows_empty":10}
["Digitar  la cláusula y el detalle de forma de pago conforme a lo establecido en el contrato inicial.",{"$nulls":5},"Digitar el detalle de forma de pago conforme a lo establecido en el contrato de adiciòn, en los casos que aplique"]
{"$rows_empty":9}
[{"$nulls":4},"Se debe generar un registro por cada CDR y fuente se utilice"]
{"$rows_empty":7}
[null,null,"Departamento o municipio que corresponda siempre debe incluir nombre y codigo DANE",null,"Digite el número de CDR expedido para amparar el contrato, fecha (el mes siempre debe venir en letras) y valor ",null,null,null,"Seleccionar fuente de acuerdo a CDR"]

{"sheet":"LISTADOS","index":2,"n_rows":126,"n_cols":34,"rows_kept":126,"cut":false,"hidden":true,"merged":[]}
["DEPARTAMENTO","AMAZONAS","ANTIOQUIA","ARAUCA","ATLÁNTICO","BOLÍVAR","BOYACÁ","CALDAS","CAQUETÁ","CASANARE","CAUCA","CESAR","CHOCÓ","CÓRDOBA","CUNDINAMARCA","GUAINÍA","GUAVIARE","HUILA","LA GUAJIRA","MAGDALENA","META","NARIÑO","PDA_NEIVA","NORTE_DE_SANTANDER","PUTUMAYO","QUINDIO","RISARALDA","SAN_ANDRÉS","SANTANDER","SUCRE","TOLIMA","VALLE_DEL_CAUCA","VAUPÉS","VICHADA"]
["AMAZONAS","EL ENCANTO","ABEJORRAL","ARAUCA - DEPARTAMENTO","ATLANTICO","ACHI","ALMEIDA","AGUADAS","ALBANIA - CAQUETA","AGUAZUL","ALMAGUER","AGUACHICA","ACANDI","AYAPEL","AGUA DE DIOS","BARRANCO MINAS","CALAMAR - GUAVIARE","ACEVEDO","ALBANIA - LA GUAJIRA","ALGARROBO","ACACIAS","ALBAN - NARIÑO","NEIVA","ABREGO","COLON - PUTUMAYO","ARMENIA - QUINDIO","APIA","PROVIDENCIA - SAN ANDRES","AGUADA","BUENAVISTA","ALPUJARRA","ALCALA","CARURU","CUMARIBO"]
["ANTIOQUIA","LA CHORRERA","ABRIAQUI","ARAUCA - MUNICIPIO","BARANOA","ALTOS DEL ROSARIO","AQUITANIA","ANSERMA","BELEN DE LOS ANDAQUIES","CASANARE","ARGELIA - CAUCA","AGUSTIN CODAZZI","ALTO BAUDO","BUENAVISTA - CORDOBA","ALBAN - CUNDINAMARCA","CACAHUAL","EL RETORNO","AGRADO","BARRANCAS","ARACATACA","BARRANCA DE UPIA","ALDANA",null,"ARBOLEDAS","LEGUIZAMO","BUENAVISTA - QUINDIO","BALBOA - RISARALDA","SAN ANDRES - MUNICIPIO","ALBANIA - SANTANDER","CAIMITO","ALVARADO","ANDALUCIA","MITU","LA PRIMAVERA"]
["ARAUCA","LA PEDRERA","ALEJANDRIA","ARAUQUITA","BARRANQUILLA","ARENAL","ARCABUCO","ARANZAZU","CAQUETA","CHAMEZA","BALBOA - CAUCA","ASTREA","ATRATO","CANALETE","ANAPOIMA","GUAINIA","GUAVIARE","AIPE","DIBULLA","ARIGUANI","CABUYARO","ANCUYA",null,"BOCHALEMA","MOCOA","CALARCA","BELEN DE UMBRIA","SAN ANDRES - DPTO.","ARATOCA","CHALAN","AMBALEMA","ANSERMANUEVO","PACOA","PUERTO CARREÑO"]
["ATLÁNTICO","LA VICTORIA - AMAZONAS","AMAGA","CRAVO NORTE","CAMPO DE LA CRUZ","ARJONA","BELEN - BOYACA","BELALCAZAR","CARTAGENA DEL CHAIRA","HATO COROZAL","BOLIVAR - CAUCA","BECERRIL","BAGADO","CERETE","ANOLAIMA","INIRIDA","MIRAFLORES - GUAVIARE","ALGECIRAS","DISTRACCION","CERRO SAN ANTONIO","CASTILLA LA NUEVA","ARBOLEDA",null,"BUCARASICA","ORITO","CIRCASIA","DOSQUEBRADAS",null,"BARBOSA - SANTANDER","COLOSO","ANZOATEGUI","ARGELIA","PAPUNAUA","SANTA ROSALIA"]
["BOLÍVAR","LETICIA","AMALFI","FORTUL","CANDELARIA - ATLANTICO","ARROYOHONDO","BERBEO","CALDAS -DPTO.","CURILLO","LA SALINA","BUENOS AIRES","BOSCONIA","BAHIA SOLANO","CHIMA - CORDOBA","APULO","LA GUADALUPE","SAN JOSE DEL GUAVIARE","ALTAMIRA","EL MOLINO","CHIBOLO","CUBARRAL","BARBACOAS",null,"CACHIRA","PUERTO ASIS","CORDOBA - QUINDIO","GUATICA",null,"BARICHARA","COROZAL","ARMERO","BOLIVAR - VALLE DEL CAUCA","TARAIRA","SANTA ROSALÍA"]
["BOYACÁ","MIRITI - PARANA","ANDES","PUERTO RONDON","GALAPA","BARRANCO DE LOBA","BETEITIVA","CHINCHINA","EL DONCELLO","MANI","CAJIBIO","CESAR","BAJO BAUDO","CHINU","ARBELAEZ","MAPIRIPANA",null,"BARAYA","FONSECA","CIENAGA","CUMARAL","BELEN - NARIÑO",null,"CACOTA","PUERTO CAICEDO","FILANDIA","LA CELIA",null,"BARRANCABERMEJA","COVEÑAS","ATACO","BUENAVENTURA","VAUPES","VICHADA"]
["CALDAS","PUERTO ALEGRIA","ANGELOPOLIS","SARAVENA","JUAN DE ACOSTA","BOLIVAR","BOAVITA","FILADELFIA","EL PAUJIL","MONTERREY","CALDONO","CHIMICHAGUA","BOJAYA","CIENAGA DE ORO","BELTRAN","MORICHAL",null,"CAMPOALEGRE","HATONUEVO","CONCORDIA - MAGDALENA","EL CALVARIO","BUESACO",null,"CHINACOTA","PUERTO GUZMAN","GENOVA","LA VIRGINIA",null,"BETULIA - SANTANDER","EL ROBLE","CAJAMARCA","BUGALAGRANDE","YAVARATE"]
["CAQUETÁ","PUERTO ARICA","ANGOSTURA","TAME","LURUACO","CALAMAR - BOLIVAR","BOYACA - MUNICIPIO","LA DORADA","FLORENCIA - CAQUETA","NUNCHIA","CALOTO","CHIRIGUANA","CARMEN DEL DARIEN","CORDOBA","BITUIMA","PANA PANA",null,"COLOMBIA","LA GUAJIRA","EL BANCO","EL CASTILLO","CHACHAGsI",null,"CHITAGA","PUTUMAYO","LA TEBAIDA","MARSELLA",null,"BOLIVAR - SANTANDER","GALERAS","CARMEN DE APICALA","CAICEDONIA"]
["CASANARE","PUERTO NARIÑO","ANORI",null,"MALAMBO","CANTAGALLO","BOYACA-  DEPARTAMENTO","LA MERCED","LA MONTAÑITA","OROCUE","CAUCA","CURUMANI","CERTEGUI","COTORRA","BOJACA","PUERTO COLOMBIA - GUAINIA",null,"ELIAS","LA JAGUA DEL PILAR","EL PIÑON","EL DORADO","COLON - NARIÑO",null,"CONVENCION","SAN FRANCISCO - PUTUMAYO","MONTENEGRO","MISTRATO",null,"BUCARAMANGA","GUARANDA","CASABIANCA","CALI"]
["CAUCA","PUERTO SANTANDER - AMAZONAS","ANZA",null,"MANATI","CARTAGENA","BRICEÑO - BOYACA","MANIZALES","MILAN","PAZ DE ARIPORO","CORINTO","EL COPEY","CHOCO","LA APARTADA","CABRERA - CUNDINAMARCA","SAN FELIPE",null,"GARZON","MAICAO","EL RETEN","FUENTE DE ORO","CONSACA",null,"CUCUTA","SAN MIGUEL - PUTUMAYO","PIJAO","PEREIRA",null,"CABRERA - SANTANDER","LA UNION - SUCRE","CHAPARRAL","CALIMA"]
["CESAR","TARAPACA","APARTADO",null,"PALMAR DE VARELA","CICUCO","BUENAVISTA - BOYACA","MANZANARES","MORELIA","PORE","EL TAMBO - CAUCA","EL PASO","CONDOTO","LORICA","CACHIPAY",null,null,"GIGANTE","MANAURE - LA GUAJIRA","FUNDACION","GRANADA","CONTADERO",null,"CUCUTILLA","SANTIAGO - PUTUMAYO","QUIMBAYA","PUEBLO RICO",null,"CALIFORNIA","LOS PALMITOS","COELLO","CANDELARIA"]
["CHOCÓ",null,"ARBOLETES",null,"PIOJO","CLEMENCIA","BUSBANZA","MARMATO","PUERTO RICO - CAQUETA","RECETOR","FLORENCIA - CAUCA","GAMARRA","EL CANTON DEL SAN PABLO","LOS CORDOBAS","CAJICA",null,null,"GUADALUPE - HUILA","RIOHACHA","GUAMAL - MAGDALENA","GUAMAL - META","CORDOBA - NARIÑO",null,"DURANIA","SIBUNDOY","QUINDIO","QUINCHIA",null,"CAPITANEJO","MAJAGUAL","COYAIMA","CARTAGO"]
["CÓRDOBA",null,"ARGELIA - ANTIOQUIA",null,"POLONUEVO","CORDOBA - BOLIVAR","CALDAS - BOYACA","MARQUETALIA","SAN JOSE DEL FRAGUA","SABANALARGA","GUACHENE","GONZALEZ","EL CARMEN DE ATRATO","MOMIL","CAPARRAPI",null,null,"HOBO","SAN JUAN DEL CESAR","MAGDALENA","LA MACARENA","CUASPUD",null,"EL CARMEN","VALLE DEL GUAMUEZ","SALENTO","RISARALDA - RISARALDA",null,"CARCASI","MORROA","CUNDAY","DAGUA"]
["CUNDINAMARCA",null,"ARMENIA - ANTIOQUIA",null,"PONEDERA","EL CARMEN DE BOLIVAR","CAMPOHERMOSO","MARULANDA","SAN VICENTE DEL CAGUAN","SACAMA","GUAPI","LA GLORIA","EL LITORAL DEL SAN JUAN","MONTELIBANO","CAQUEZA",null,null,"HUILA","URIBIA","NUEVA GRANADA","LEJANIAS","CUMBAL",null,"EL TARRA","VILLAGARZON",null,"SANTA ROSA DE CABAL",null,"CEPITA","OVEJAS","DOLORES","EL AGUILA"]
["GUAINÍA",null,"BARBOSA - ANTIOQUIA",null,"PUERTO COLOMBIA - ATLANTICO","EL GUAMO","CERINZA","NEIRA","SOLANO","SAN LUIS DE PALENQUE","INZA","LA JAGUA DE IBIRICO","ISTMINA","MONTERIA","CARMEN DE CARUPA",null,null,"IQUIRA","URUMITA","PEDRAZA","MAPIRIPAN","CUMBITARA",null,"EL ZULIA",null,null,"SANTUARIO",null,"CERRITO","PALMITO","ESPINAL","EL CAIRO"]
["GUAVIARE",null,"BELLO",null,"REPELON","EL PEÑON - BOLIVAR","CHINAVITA","NORCASIA","SOLITA","TAMARA","JAMBALO","LA PAZ - CESAR","JURADO","MOÑITOS","CHAGUANI",null,null,"ISNOS","VILLANUEVA - LA GUAJIRA","PIJIÑO DEL CARMEN","MESETAS","EL CHARCO",null,"GRAMALOTE",{"$nulls":4},"CHARALA","SAMPUES","FALAN","EL CERRITO"]
["HUILA",null,"BELMIRA",null,"SABANAGRANDE","HATILLO DE LOBA","CHIQUINQUIRA","PACORA","VALPARAISO","TAURAMENA","LA SIERRA","MANAURE - CESAR","LLORO","PLANETA RICA","CHIA",null,null,"LA ARGENTINA",null,"PIVIJAY","META","EL PEÑOL",null,"HACARI",{"$nulls":4},"CHARTA","SAN BENITO ABAD","FLANDES","EL DOVIO"]
["LA GUAJIRA",null,"BETANIA",null,"SABANALARGA - ATLANTICO","MAGANGUE","CHIQUIZA","PALESTINA - CALDAS",null,"TRINIDAD","LA VEGA - CAUCA","PAILITAS","MEDIO ATRATO","PUEBLO NUEVO","CHIPAQUE",null,null,"LA PLATA",null,"PLATO","PUERTO CONCORDIA","EL ROSARIO",null,"HERRAN",{"$nulls":4},"CHIMA - SANTANDER","SAN JUAN DE BETULIA","FRESNO","FLORIDA"]
["MAGDALENA",null,"BETULIA - ANTIOQUIA",null,"SANTA LUCIA","MAHATES","CHISCAS","PENSILVANIA",null,"VILLANUEVA","LOPEZ","PELAYA","MEDIO BAUDO","PUERTO ESCONDIDO","CHOACHI",null,null,"NATAGA",null,"PUEBLOVIEJO","PUERTO GAITAN","EL TABLON DE GOMEZ",null,"LA ESPERANZA",{"$nulls":4},"CHIPATA","SAN LUIS DE SINCE","GUAMO","GINEBRA"]
["META",null,"BRICEÑO - ANTIOQUIA",null,"SANTO TOMAS","MARGARITA","CHITA","RIOSUCIO",null,"YOPAL","MERCADERES","PUEBLO BELLO","MEDIO SAN JUAN","PUERTO LIBERTADOR","CHOCONTA",null,null,"NEIVA",null,"REMOLINO","PUERTO LLERAS","EL TAMBO - NARIÑO",null,"LA PLAYA",{"$nulls":4},"CIMITARRA","SAN MARCOS","HERVEO","GUACARI"]
["NARIÑO",null,"BURITICA",null,"SOLEDAD","MARIA LA BAJA","CHITARAQUE","RISARALDA - CALDAS",null,null,"MIRANDA","RIO DE ORO","NOVITA","PURISIMA","COGUA",null,null,"OPORAPA",null,"SABANAS DE SAN ANGEL","PUERTO LOPEZ","FRANCISCO PIZARRO",null,"LABATECA",{"$nulls":4},"CONCEPCION - SANTANDER","SAN ONOFRE","HONDA","GUADALAJARA DE BUGA"]
["PDA_NEIVA",null,"CACERES",null,"SUAN","MOMPOS","CHIVATA","SALAMINA - CALDAS",null,null,"MORALES - CAUCA","SAN ALBERTO","NUQUI","SAHAGUN","COTA",null,null,"PAICOL",null,"SALAMINA - MAGDALENA","PUERTO RICO - META","FUNES",null,"LOS PATIOS",{"$nulls":4},"CONFINES","SAN PEDRO - SUCRE","IBAGUE","JAMUNDI"]
["NORTE_DE_SANTANDER",null,"CAICEDO",null,"TUBARA","MONTECRISTO","CHIVOR","SAMANA",null,null,"PADILLA","SAN DIEGO","QUIBDO","SAN ANDRES SOTAVENTO","CUCUNUBA",null,null,"PALERMO",null,"SAN SEBASTIAN DE BUENAVISTA","RESTREPO - META","GUACHUCAL",null,"LOURDES",{"$nulls":4},"CONTRATACION","SANTIAGO DE TOLU","ICONONZO","LA CUMBRE"]
["PUTUMAYO",null,"CALDAS - ANTIOQUIA",null,"USIACURI","MORALES - BOLIVAR","CIENEGA","SAN JOSE",null,null,"PAEZ - CAUCA","SAN MARTIN - CESAR","RIO IRO","SAN ANTERO","CUNDINAMARCA",null,null,"PALESTINA - HUILA",null,"SAN ZENON","SAN CARLOS DE GUAROA","GUAITARILLA",null,"MUTISCUA",{"$nulls":4},"COROMORO","SINCELEJO","LERIDA","LA UNION - VALLE DEL CAUCA"]
["QUINDIO",null,"CAMPAMENTO",null,null,"NOROSI","COMBITA","SUPIA",null,null,"PATIA","TAMALAMEQUE","RIO QUITO","SAN BERNARDO DEL VIENTO","EL COLEGIO",null,null,"PITAL",null,"SANTA ANA","SAN JUAN DE ARAMA","GUALMATAN",null,"NORTE DE SANTANDER",{"$nulls":4},"CURITI","SUCRE - MUNICIPIO","LIBANO","LA VICTORIA - VALLE DEL CAUCA"]
["RISARALDA",null,"CAÑASGORDAS",null,null,"PINILLOS","COPER","VICTORIA",null,null,"PIAMONTE","VALLEDUPAR","RIOSUCIO","SAN CARLOS - CORDOBA","EL PEÑON - CUNDINAMARCA",null,null,"PITALITO",null,"SANTA BARBARA DE PINTO","SAN JUANITO","ILES",null,"OCAÑA",{"$nulls":4},"EL CARMEN DE CHUCURI","SUCRE - DPTO.","MARIQUITA","OBANDO"]
["SAN_ANDRÉS",null,"CARACOLI",null,null,"REGIDOR","CORRALES","VILLAMARIA",null,null,"PIENDAMO",null,"SAN JOSE DEL PALMAR","SAN PELAYO","EL ROSAL",null,null,"RIVERA",null,"SANTA MARTA","SAN MARTIN - META","IMUES",null,"PAMPLONA",{"$nulls":4},"EL GUACAMAYO","TOLU VIEJO","MELGAR","PALMIRA"]
["SANTANDER",null,"CARAMANTA",null,null,"RIO VIEJO","COVARACHIA","VITERBO",null,null,"POPAYAN",null,"SIPI","TIERRALTA","FACATATIVA",null,null,"SALADOBLANCO",null,"SITIONUEVO","URIBE","IPIALES",null,"PAMPLONITA",{"$nulls":4},"EL PEÑON",null,"MURILLO","PRADERA"]
["SUCRE",null,"CAREPA",null,null,"SAN CRISTOBAL","CUBARA",null,null,null,"PUERTO TEJADA",null,"TADO","VALENCIA","FOMEQUE",null,null,"SAN AGUSTIN",null,"TENERIFE","VILLAVICENCIO","LA CRUZ",null,"PUERTO SANTANDER - NTE SANTANDER",{"$nulls":4},"EL PLAYON",null,"NATAGAIMA","RESTREPO - VALLE DEL CAUCA"]
{"$rows_left_out":97}
{"sheet":"CODI_DANE","index":3,"n_rows":1172,"n_cols":9,"rows_kept":1172,"cut":false,"hidden":true,"merged":[]}
["Nombre Departamento","Nombre Municipio","Código\nMunicipio",null,null,null,"PAP-PDA"]
["ANTIOQUIA","ABEJORRAL",5002,false,null,"AMAZONAS","AMAZONAS",91000,{"$f":"CONCATENATE(\"PAP-PDA - \",VLOOKUP('Programación de pagos'!$B$6,$F$2:$H$34,3,))","v":"PAP-PDA - 68000"}]
["N. DE SANTANDER","ABREGO",54003,false,null,"ANTIOQUIA","ANTIOQUIA",5000]
["ANTIOQUIA","ABRIAQUI",5004,false,null,"ARAUCA","ARAUCA",8100]
["META","ACACIAS",50006,false,null,"ATLÁNTICO","ATLÁNTICO",8000]
["CHOCO","ACANDI",27006,false,null,"BOLÍVAR","BOLÍVAR",13000]
["HUILA","ACEVEDO",41006,false,null,"BOYACÁ","BOYACA",15000]
["BOLIVAR","ACHI",13006,false,null,"CALDAS","CALDAS",17000]
["HUILA","AGRADO",41013,false,null,"CAQUETÁ","CAQUETA",18000]
["CUNDINAMARCA","AGUA DE DIOS",25001,false,null,"CASANARE","CASANARE",85000]
["CESAR","AGUACHICA",20011,false,null,"CAUCA","CAUCA",19000]
["SANTANDER","AGUADA",68013,false,null,"CESAR","CESAR",20999]
["CALDAS","AGUADAS",17013,false,null,"CHOCÓ","CHOCÓ",27000]
["CASANARE","AGUAZUL",85010,false,null,"CÓRDOBA","CÓRDOBA",23000]
["CESAR","AGUSTIN CODAZZI",20013,false,null,"CUNDINAMARCA","CUNDINAMARCA",25000]
["HUILA","AIPE",41016,false,null,"GUAINÍA","GUAINÍA",94000]
["CUNDINAMARCA","ALBAN - CUNDINAMARCA",25019,false,null,"GUAVIARE","GUAVIARE",95000]
["NARIÑO","ALBAN - NARIÑO",52019,false,null,"HUILA","HUILA",41000]
["CAQUETA","ALBANIA - CAQUETA",18029,false,null,"PDA_NEIVA","PDA NEIVA",41001]
["LA GUAJIRA","ALBANIA - LA GUAJIRA",44035,false,null,"LA GUAJIRA","GUAJIRA",44000]
["SANTANDER","ALBANIA - SANTANDER",68020,false,null,"MAGDALENA","MAGDALENA ",47000]
["VALLE DEL CAUCA","ALCALA",76020,false,null,"META","META",50000]
["NARIÑO","ALDANA",52022,false,null,"NARIÑO","NARIÑO",52000]
["ANTIOQUIA","ALEJANDRIA",5021,false,null,"NORTE_DE_SANTANDER","NORTE DE SANTANDER",54000]
["MAGDALENA","ALGARROBO",47030,false,null,"PUTUMAYO","PUTUMAYO ",86000]
["HUILA","ALGECIRAS",41020,false,null,"QUINDIO","QUINDÍO",63000]
["CAUCA","ALMAGUER",19022,false,null,"RISARALDA","RISARALDA",66000]
["BOYACA","ALMEIDA",15022,false,null,"SAN_ANDRÉS","SAN ANDRÉS",88000]
["TOLIMA","ALPUJARRA",73024,false,null,"SANTANDER","SANTANDER",68000]
["HUILA","ALTAMIRA",41026,false,null,"SUCRE","SUCRE",70000]
{"$rows_left_out":1142}