{"text_format":"2","workbook":"xlsx","n_sheets":3,"sheets":["FORMATO","PDA","CTAS BANCARIAS"],"not_rendered":{"charts":0,"images":2,"macros":0,"external_links":0,"defined_names":5,"comments":0,"pivot_tables":0},"unopened":[],"bounds":{"document_bytes":16777216,"sheet_cells":100000,"run_cost":"one","rows_first":2000,"rows_last":500,"rows_between":2000,"halvings":0,"cell_chars":16384,"cell_head_chars":4096},"cells_cut":0,"cells_raw":0,"read":"whole","date_system":"1900"}

{"sheet":"FORMATO","index":0,"n_rows":30,"n_cols":8,"rows_kept":30,"cut":false,"hidden":false,"merged":[[27,1,27,3],[28,1,28,3],[29,1,29,3],[1,0,1,7],[2,0,2,7],[15,0,15,7],[13,0,13,6],[6,0,6,7],[19,0,19,7]]}
[{"$nulls":6}," (Versión 04 - Marzo 1° /2024)"]
["PATRIMONIO AUTONOMO FIA - FORMATO DE INVERSIÓN DE RECURSOS"]
["RENDIMIENTOS ANTICIPOS CONTRATOS DE OBRA"]
[]
[]
["PDA","CESAR"]
["A través del presente documento, se requiere la inversión de los recursos detallados a continuación, los cuales corresponden a Rendimientos derivados de Anticipos sobre Contratos de Obra:"]
[]
["FECHA DE INGRESO CTA P.A. FIA","FUENTE DE FINANCIACIÓN","CUENTA BANCARIA RECAUDADORA","NOMBRE DEL CONTRATISTA","DEPARTAMENTO/MUNICIPIO AL QUE SE LE REALIZARÁ LA INVERSIÓN","(**) No. IDENTIFICACIÓN ENTIDAD GIRADORA  \n(FONDO DE INVERSION COLECTIVA O BANCO)","(**) NOMBRE ENTIDAD GIRADORA  \n(FONDO DE INVERSION COLECTIVA O BANCO)","VALOR RENDIMIENTOS"]
[null,null,{"$f":"VLOOKUP(B10,'CTAS BANCARIAS'!A5:B17,2,0)","v":{"$error":"#N/A"}}]
[null,null,{"$f":"VLOOKUP(B11,'CTAS BANCARIAS'!A6:B18,2,0)","v":{"$error":"#N/A"}}]
[null,null,{"$f":"VLOOKUP(B12,'CTAS BANCARIAS'!A7:B19,2,0)","v":{"$error":"#N/A"}}]
[null,null,{"$f":"VLOOKUP(B13,'CTAS BANCARIAS'!A8:B20,2,0)","v":{"$error":"#N/A"}}]
["TOTAL RENDIMIENTOS ANTICIPOS CONTRATOS DE OBRA",{"$nulls":6},{"$f":"SUM(H10:H13)","v":0}]
[]
["(**) Cuando los recursos transferidos a las cuentas del P.A. FIA provengan de una FIDUCIARIA, se precisa que los datos que deben registrar son el Nit y Nombre del Fondo de Inversión Colectiva desde el cual se realiza el giro al P.A. FIA"]
[]
["Observaciones:"]
{"$rows_empty":8}
["FIRMA AUTORIZADA"]
["NOMBRE"]
["CARGO"]
["ENTIDAD"]

{"sheet":"PDA","index":1,"n_rows":33,"n_cols":3,"rows_kept":33,"cut":false,"hidden":false,"merged":[]}
[null,"No.","DEPARTAMENTO"]
[null,1,"AMAZONAS"]
[null,2,"ANTIOQUIA"]
[null,3,"ARAUCA"]
[null,4,"ATLANTICO"]
[null,5,"BOLIVAR"]
[null,6,"BOYACA"]
[null,7,"CALDAS"]
[null,8,"CAQUETA"]
[null,9,"CASANARE"]
[null,10,"CAUCA"]
[null,11,"CESAR"]
[null,12,"CHOCO"]
[null,13,"CORDOBA"]
[null,14,"CUNDINAMARCA"]
[null,15,"GUAINIA"]
[null,16,"GUAVIARE"]
[null,17,"HUILA"]
[null,18,"LA GUAJIRA"]
[null,19,"MAGDALENA"]
[null,20,"META"]
[null,21,"NARIÑO"]
[null,22,"NORTE DE SANTANDER"]
[null,23,"PUTUMAYO"]
[null,24,"QUINDIO"]
[null,25,"RISARALDA"]
[null,26,"SAN ANDRES"]
[null,27,"SANTANDER"]
[null,28,"SUCRE"]
[null,29,"TOLIMA"]
[null,30,"VALLE DEL CAUCA"]
[null,31,"VAUPES"]
[null,32,"VICHADA"]

{"sheet":"CTAS BANCARIAS","index":2,"n_rows":18,"n_cols":6,"rows_kept":18,"cut":false,"hidden":false,"merged":[]}
[]
[null,null,"PATRIMONIO AUTÓNOMO FIA"]
[null,null,"RELACIÓN DE CUENTAS BANCARIAS DEL FIDEICOMISO PARA RECAUDO"]
[]
["Versión Noviembre 2021"]
["FUENTE DE FINANCIACION","No. CUENTA","ENTIDAD FINANCIERA","TIPO CUENTA","NOMBRE DE LA CUENTA","CONVENIO"]
["SGP","031-469589-64","BANCOLOMBIA","CORRIENTE","PA FIA SGP AGUA POTABLE Y SANEAMIENTO BÁSICO ","33013 - Activo"]
["NACIÓN - AUD. PÚBLICAS","031-469590-62","BANCOLOMBIA","CORRIENTE","PA FIA - RECURSOS PROVENIENTES DE LA NACIÓN ","33017 - Activo "]
["OTROS RECURSOS","031-469591-20","BANCOLOMBIA","CORRIENTE","PA FIA - OTROS RECURSOS ","33018 - Activo "]
["REGALIAS DIRECTAS","031-470292-08","BANCOLOMBIA","CORRIENTE","PA FIA - REGALIAS DIRECTAS ","33012 - Activo "]
["RECURSOS CAR","013-142808-61","BANCOLOMBIA","CORRIENTE","PA FIA RECURSOS CAR","76153 - Activo "]
["RECURSOS BID","031-221746-44","BANCOLOMBIA","CORRIENTE","PA FIA - RECURSOS PROVENIENTES DEL CREDITO BID","76152 - Activo "]
["CONT. PLAN - SGP","031-469588-51","BANCOLOMBIA","CORRIENTE","PA FIA SGP ASIGNACIONES FONDO NAL DE REGALIAS ","33016 - Activo "]
["PROYECTOS ESTRATEGICOS","031-771088-18","BANCOLOMBIA","CORRIENTE","RECURSOS PROVENIENTES DE LA NACIÓN EXT","76150 - Activo "]
["COMPROMISO POR COLOMBIA","690-000018-57","BANCOLOMBIA","CORRIENTE","RECAUDO COMPROMISO POR COLOMBIA","Sin Convenio "]
["FDO. COMP. REGIONAL","031-894083-46","BANCOLOMBIA","CORRIENTE","FONDO DE COMPENSACION REGIONAL","76151 - Activo "]
["COLOMBIA POTENCIA MUNDIAL DE LA VIDA","031-000049-74","BANCOLOMBIA","CORRIENTE","COLOMBIA POTENCIA MUNDIAL DE LA VIDA"]
["OPERACIONES DE CRÉDITO","031-000164-81","BANCOLOMBIA","CORRIENTE","RECAUDADORA OPERACIONES DE CRÉDITO","Sin Convenio "]