{"text_format":"2","workbook":"xlsx","n_sheets":4,"sheets":["FORMATO ANULACIÓN","INSTRUCTIVO ANULACIÓN","DANE","LISTADOS"],"not_rendered":{"charts":0,"images":1,"macros":0,"external_links":0,"defined_names":38,"comments":1,"pivot_tables":0},"unopened":[],"bounds":{"document_bytes":16777216,"sheet_cells":100000,"run_cost":"one","rows_first":2000,"rows_last":500,"rows_between":2000,"halvings":0,"cell_chars":16384,"cell_head_chars":4096},"cells_cut":0,"cells_raw":0,"read":"whole","date_system":"1900"}

{"sheet":"FORMATO ANULACIÓN","index":0,"n_rows":61,"n_cols":9,"rows_kept":61,"cut":false,"hidden":false,"merged":[[63,0,63,8],[53,3,53,7],[54,3,54,7],[55,3,55,7],[56,3,56,7],[59,1,59,8],[60,1,60,8],[9,0,9,8],[17,1,18,2],[1,7,7,8],[5,0,6,6],[1,0,4,6],[17,0,19,0],[17,3,19,3],[17,4,19,4],[17,5,19,5],[17,6,19,6],[17,7,19,7],[50,3,50,5],[14,0,15,8],[17,8,19,8],[11,0,11,6],[12,0,12,6]]}
[]
["PATRIMONIO AUTÓNOMO FIA",{"$nulls":6},"RADICACIÓN"]
[]
[]
[]
["FORMATO SOLICITUD DE ANULACIÓN \nDE CERTIFICADOS DE DISPONIBILIDAD DE RECURSOS - CDR"]
[]
[]
[]
["1. INFORMACION BÁSICA"]
[]
["PDA DEL DEPARTAMENTO DE:",{"$nulls":6},"FECHA - (DD/MM/AAAA):"]
["--------------",{"$nulls":6},"No SOLICITUD"]
[]
["CDR´s POR ANULAR"]
[]
[]
["No","ORIGEN DE LOS RECURSOS",null,"No. CDR","FECHA EXPEDICIÓN CDR\n(DD/MM/AAAA)","FUENTE DE RECURSOS","VALOR CDR","PRORROGADO\nSI / NO","OBSERVACIONES"]
[]
[null,"DANE","(Departamento/ Municipio)"]
[1,{"$f":"IFERROR(VLOOKUP(C21,DANE!$A$2:$C$825,3,),\"\")","v":""}]
[2,{"$f":"IFERROR(VLOOKUP(C22,DANE!$A$2:$C$825,3,),\"\")","v":""}]
[3,{"$f":"IFERROR(VLOOKUP(C23,DANE!$A$2:$C$825,3,),\"\")","v":""}]
[4,{"$f":"IFERROR(VLOOKUP(C24,DANE!$A$2:$C$825,3,),\"\")","v":""}]
[5,{"$f":"IFERROR(VLOOKUP(C25,DANE!$A$2:$C$825,3,),\"\")","v":""}]
[6,{"$f":"IFERROR(VLOOKUP(C26,DANE!$A$2:$C$825,3,),\"\")","v":""}]
[7,{"$f":"IFERROR(VLOOKUP(C27,DANE!$A$2:$C$825,3,),\"\")","v":""}]
[8,{"$f":"IFERROR(VLOOKUP(C28,DANE!$A$2:$C$825,3,),\"\")","v":""}]
[9,{"$f":"IFERROR(VLOOKUP(C29,DANE!$A$2:$C$825,3,),\"\")","v":""}]
[10,{"$f":"IFERROR(VLOOKUP(C30,DANE!$A$2:$C$825,3,),\"\")","v":""}]
[11,{"$f":"IFERROR(VLOOKUP(C31,DANE!$A$2:$C$825,3,),\"\")","v":""}]
[12,{"$f":"IFERROR(VLOOKUP(C32,DANE!$A$2:$C$825,3,),\"\")","v":""}]
[13,{"$f":"IFERROR(VLOOKUP(C33,DANE!$A$2:$C$825,3,),\"\")","v":""}]
[14,{"$f":"IFERROR(VLOOKUP(C34,DANE!$A$2:$C$825,3,),\"\")","v":""}]
[15,{"$f":"IFERROR(VLOOKUP(C35,DANE!$A$2:$C$825,3,),\"\")","v":""}]
[16,{"$f":"IFERROR(VLOOKUP(C36,DANE!$A$2:$C$825,3,),\"\")","v":""}]
[17,{"$f":"IFERROR(VLOOKUP(C37,DANE!$A$2:$C$825,3,),\"\")","v":""}]
[18,{"$f":"IFERROR(VLOOKUP(C38,DANE!$A$2:$C$825,3,),\"\")","v":""}]
[19,{"$f":"IFERROR(VLOOKUP(C39,DANE!$A$2:$C$825,3,),\"\")","v":""}]
[20,{"$f":"IFERROR(VLOOKUP(C40,DANE!$A$2:$C$825,3,),\"\")","v":""}]
[21,{"$f":"IFERROR(VLOOKUP(C41,DANE!$A$2:$C$825,3,),\"\")","v":""}]
[22,{"$f":"IFERROR(VLOOKUP(C42,DANE!$A$2:$C$825,3,),\"\")","v":""}]
[23,{"$f":"IFERROR(VLOOKUP(C43,DANE!$A$2:$C$825,3,),\"\")","v":""}]
[24,{"$f":"IFERROR(VLOOKUP(C44,DANE!$A$2:$C$825,3,),\"\")","v":""}]
[25,{"$f":"IFERROR(VLOOKUP(C45,DANE!$A$2:$C$825,3,),\"\")","v":""}]
[26,{"$f":"IFERROR(VLOOKUP(C46,DANE!$A$2:$C$825,3,),\"\")","v":""}]
[27,{"$f":"IFERROR(VLOOKUP(C47,DANE!$A$2:$C$825,3,),\"\")","v":""}]
[28,{"$f":"IFERROR(VLOOKUP(C48,DANE!$A$2:$C$825,3,),\"\")","v":""}]
[29,{"$f":"IFERROR(VLOOKUP(C49,DANE!$A$2:$C$825,3,),\"\")","v":""}]
[30,{"$f":"IFERROR(VLOOKUP(C50,DANE!$A$2:$C$825,3,),\"\")","v":""}]
[null,null,null,"VALOR TOTAL DE ANULACIONES EN ESTA SOLICITUD",null,null,{"$f":"SUM(G21:G50)","v":0}]
[]
[]
[null,null,"FIRMA"]
[null,null,"NOMBRE"]
[null,null,null,"Representante Legal del Fideicomitente o Gestor"]
[null,null,null,{"$f":"CONCATENATE(\"PDA DEPARTAMENTO DE \",A13)","v":"PDA DEPARTAMENTO DE --------------"}]
[]
[null,"NOTAS"]
[null,"*Para todas las anulaciones de CDR'S, es requisito no tener contratos asociados al mismo. Ver MOE "]
[null,"*Adjuntar CDR y su respectiva Prórroga si la hubiere, en caso de extravío anexar denuncia de perdida de documento ante la entidad competente. Ver MOE"]

{"sheet":"INSTRUCTIVO ANULACIÓN","index":1,"n_rows":24,"n_cols":3,"rows_kept":24,"cut":false,"hidden":false,"merged":[]}
[]
[]
[null,null,"INSTRUCTIVO DILIGENCIAMIENTO FORMATO ANULACIÓN DE CDR´s"]
[]
[]
[]
["1. INFORMACIÓN BÁSICA"]
[null,"PAP - PDA DEL DEPARTAMENTO DE: ","Seleccione en la lista desplegable, el nombre del PDA que solicita la Anulación del compromiso presupuestal"]
[null,"FECHA (DD/MM/AAAA): ","Fecha de diligenciamiento del formato"]
[null,"No. SOLICITUD:","Consecutivo del PDA "]
[]
["2. CDR´s POR ANULAR"]
[null,"ORIGEN DE LOS RECURSOS\n(CÓDIGO DANE)","Se asigna automáticamente, después de seleccionar en la columna \"Departamento/Municipio\""]
[null,"ORIGEN DE LOS RECURSOS\n(DEPARTAMENTO/MUNICIPIO)","Seleccione en la lista desplegable, el nombre del ente territorial cuyo origen de recursos es el CDR objeto de Anulación. \nLos nombres que se desplieguen en esta casilla, dependen del Departamento seleccionado en la \"INFORMACIÓN BÁSICA\""]
[null,"No. CDR","Relacione el número del CDR por Anular"]
[null,"FECHA EXPEDICIÓN CDR\n(DD/MM/AAAA)","Relacione la Fecha de Expedición del CDR por Anular"]
[null,"FUENTE DE RECURSOS","Seleccione en la lista desplegable, la fuente de recursos del CDR por Anular: \n* SGP - Sistema General de Participaciones\n* Regalías Directas\n* Regalías SGR - Fondo Compensación Regional\n* Nación (Audiencias Públicas)\n* Nación (Proyectos Estratégicos)  \n* Recursos CAR\n* Otros Recursos\n* Banco Mundial\n* Contrato Plan SGP\n* Contrato Plan Nación\n* Contrato Plan Regalías\n* Crédito BID\n* Recursos Crédito\n* Nación Compromiso por Colombia"]
[null,"VALOR CDR","Relacione el valor del CDR por Anular"]
[null,"PRORROGADO\nSI / NO","Seleccione si el CDR fue Prorrogado."]
[null,"OBSERVACIONES","Indique si el documento original fue extraviado y adjunte la denuncia respectiva como soporte de la Solicitud de Anulación o relacione aclaraciones que crea convenientes para el Proceso de Anulación de CDR´s."]
[]
["3. FIRMA"]
[null,"FIRMA","Se registra la firma del Representante Legal del Fideicomitente o Gestor"]
[null,"NOMBRE","Se registra el nombre del Representante Legal del Fideicomitente o Gestor"]

{"sheet":"DANE","index":2,"n_rows":804,"n_cols":18,"rows_kept":804,"cut":false,"hidden":true,"merged":[[0,5,0,6]]}
["MUNICIPIO","DPTO/MPIO","DANE","DEPARTAMENTO",null,"TIPO DE GASTO",{"$nulls":11},"NEIVA"]
["AMAZONAS_","Departamento",91999,"AMAZONAS",null,"COMPONENTE","SUBCOMPONENTE"]
["EL ENCANTO","ANM",91263,"AMAZONAS","","Infraestructura en Agua y Saneamiento","Pre-Inversión"]
["LA CHORRERA","ANM",91405,"AMAZONAS","","Desarrollo Institucional","Inversión"]
["LA PEDRERA","ANM",91407,"AMAZONAS","","Proyectos Ambientales","Interventoría"]
["LA VICTORIA","ANM",91430,"AMAZONAS","","Desarrollo sector rural","Estructura Operativa"]
["MIRITI - PARANÁ","ANM",91460,"AMAZONAS","","Comunidades Indigenas/afrocolombianas","Otros"]
["PUERTO ALEGRÍA","ANM",91530,"AMAZONAS","","Gestión del Riesgo Sectorial"]
["PUERTO ARICA","ANM",91536,"AMAZONAS",""]
["PUERTO NARIÑO","Municipio",91540,"AMAZONAS","","FUENTE DE RECURSOS","PRORROGA"]
["PUERTO_SANTANDER","ANM",91669,"AMAZONAS","","SGP Agua potable y Saneamiento basico","SI"]
["TARAPACÁ","ANM",91798,"AMAZONAS","","Regalías Directas","NO"]
["ANTIOQUIA_","Departamento",5999,"ANTIOQUIA","","Regalías SGR - Fondo Compensación Regional"]
["ABEJORRAL","Municipio",5002,"ANTIOQUIA","","Regalías SGR - Fondo Desarrollo Regional"]
["ALEJANDRÍA","Municipio",5021,"ANTIOQUIA","","Nación (Audiencias Públicas)"]
["AMAGA","Municipio",5030,"ANTIOQUIA","","Nación (Proyectos Estratégicos)"]
["AMALFI","Municipio",5031,"ANTIOQUIA","","Recursos CAR"]
["ANDES","Municipio",5034,"ANTIOQUIA","","Otros Recursos"]
["ANGELOPOLIS","Municipio",5036,"ANTIOQUIA","","Banco Mundial"]
["ANORÍ","Municipio",5040,"ANTIOQUIA","","Contrato Plan SGP"]
["SANTAFE DE ANTIOQUIA","Municipio",5042,"ANTIOQUIA","","Contrato Plan Nación"]
["ANZA","Municipio",5044,"ANTIOQUIA","","Contrato Plan Regalías"]
["ARBOLETES","Municipio",5051,"ANTIOQUIA","","Crédito BID"]
["ARGELIA","Municipio",5055,"ANTIOQUIA","","Recursos Crédito"]
["ARMENIA","Municipio",5059,"ANTIOQUIA","","Nación Compromiso por Colombia"]
["BETULIA","Municipio",5093,"ANTIOQUIA",""]
["CIUDAD BOLIVAR","Municipio",5101,"ANTIOQUIA",""]
["BRICEÑO","Municipio",5107,"ANTIOQUIA",""]
["BURITICA","Municipio",5113,"ANTIOQUIA",""]
["CACERES","Municipio",5120,"ANTIOQUIA",""]
["CAICEDO","Municipio",5125,"ANTIOQUIA",""]
["CAMPAMENTO","Municipio",5134,"ANTIOQUIA"]
["CAÑASGORDAS","Municipio",5138,"ANTIOQUIA",""]
["CARACOLI","Municipio",5142,"ANTIOQUIA",""]
["CAREPA","Municipio",5147,"ANTIOQUIA",""]
["CAROLINA","Municipio",5150,"ANTIOQUIA",""]
["CAUCASIA","Municipio",5154,"ANTIOQUIA",""]
["CISNEROS","Municipio",5190,"ANTIOQUIA",""]
["COCORNÁ","Municipio",5197,"ANTIOQUIA",""]
["CONCORDIA","Municipio",5209,"ANTIOQUIA",""]
["DON MATIAS","Municipio",5237,"ANTIOQUIA"]
["EL BAGRE","Municipio",5250,"ANTIOQUIA",""]
["ENTRERRIOS","Municipio",5264,"ANTIOQUIA",""]
["FREDONIA","Municipio",5282,"ANTIOQUIA"]
["FRONTINO","Municipio",5284,"ANTIOQUIA",""]
["GIRALDO","Municipio",5306,"ANTIOQUIA",""]
["GOMEZ PLATA","Municipio",5310,"ANTIOQUIA",""]
["GUATAPÉ","Municipio",5321,"ANTIOQUIA",""]
["GUARNE","Municipio",5318,"ANTIOQUIA"]
["VALPARAISO","Municipio",5856,"ANTIOQUIA"]
["CONCEPCION","Municipio",5206,"ANTIOQUIA"]
["HELICONIA","Municipio",5347,"ANTIOQUIA",""]
["HISPANIA","Municipio",5353,"ANTIOQUIA",""]
["ITUANGO","Municipio",5361,"ANTIOQUIA",""]
["JARDIN","Municipio",5364,"ANTIOQUIA"]
["JERICO","Municipio",5368,"ANTIOQUIA",""]
["LA CEJA","Municipio",5376,"ANTIOQUIA",""]
["LA PINTADA","Municipio",5390,"ANTIOQUIA",""]
["LA UNIÓN","Municipio",5400,"ANTIOQUIA",""]
["LIBORINA","Municipio",5411,"ANTIOQUIA",""]
["MACEO","Municipio",5425,"ANTIOQUIA",""]
["MONTEBELLO","Municipio",5467,"ANTIOQUIA",""]
["MURINDO","Municipio",5475,"ANTIOQUIA",""]
["MUTATÁ","Municipio",5480,"ANTIOQUIA"]
["NARIÑO","Municipio",5483,"ANTIOQUIA",""]
["NECOCLI","Municipio",5490,"ANTIOQUIA",""]
["NECHI","Municipio",5495,"ANTIOQUIA",""]
["OLAYA","Municipio",5501,"ANTIOQUIA",""]
["EL PEÑOL","Municipio",5541,"ANTIOQUIA",""]
["PUEBLORRICO","Municipio",5576,"ANTIOQUIA",""]
["PUERTO BERRIO","Municipio",5579,"ANTIOQUIA",""]
["PUERTO NARE","Municipio",5585,"ANTIOQUIA",""]
["PUERTO TRIUNFO","Municipio",5591,"ANTIOQUIA"]
["REMEDIOS","Municipio",5604,"ANTIOQUIA",""]
["SABANALARGA","Municipio",5628,"ANTIOQUIA",""]
["SALGAR","Municipio",5642,"ANTIOQUIA",""]
["SAN ANDRÉS","Municipio",5647,"ANTIOQUIA",""]
["SAN CARLOS","Municipio",5649,"ANTIOQUIA",""]
["SAN FRANCISCO","Municipio",5652,"ANTIOQUIA",""]
["SAN JERONIMO","Municipio",5656,"ANTIOQUIA",""]
{"$rows_left_out":725}
{"sheet":"LISTADOS","index":3,"n_rows":111,"n_cols":34,"rows_kept":111,"cut":false,"hidden":true,"merged":[]}
["DEPARTAMENTO","AMAZONAS_","ANTIOQUIA_","ARAUCA_","ATLÁNTICO_","BOLÍVAR_","BOYACÁ_","CALDAS_","CAQUETÁ_","CASANARE_","CAUCA_","CESAR_","CHOCÓ_","CÓRDOBA_","CUNDINAMARCA_","GUAINÍA_","GUAVIARE_","HUILA_","LA_GUAJIRA_","MAGDALENA_","META_","NARIÑO_","NEIVA_","NORTE_DE_SANTANDER_","PUTUMAYO_","QUINDIO_","RISARALDA_","SAN_ANDRÉS_","SANTANDER_","SUCRE_","TOLIMA_","VALLE_DEL_CAUCA_","VAUPÉS_","VICHADA_"]
["--------------","EL ENCANTO","ABEJORRAL",null,"PUERTO COLOMBIA","ACHI","ALMEIDA","MANIZALES","FLORENCIA",null,"POPAYAN","AGUSTIN CODAZZI","CANTÓN DEL SAN PABLO","MONTERIA","AGUA DE DIOS","INIRIDA","SAN JOSE DEL GUAVIARE","ACEVEDO",null,null,"ACACIAS","PASTO","NEIVA.","ARBOLEDAS","PUERTO CAICEDO","ARMENIA","PEREIRA","SAN ANDRÉS.","AGUADA","BUENAVISTA","IBAGUE","ANDALUCIA","MITU","LA PRIMAVERA"]
["AMAZONAS_","LA CHORRERA","ALEJANDRÍA",null,null,"ARENAL","AQUITANIA","AGUADAS","ALBANIA",null,"ARGELIA",null,"RIO QUITO","AYAPEL","ALBAN","BARRANCO MINAS","CALAMAR","AGRADO",null,null,"BARRANCA DE UPIA","ALBAN",null,"BOCHALEMA","SANTIAGO","BUENAVISTA","APIA","PROVIDENCIA","ALBANIA","CAIMITO","ALPUJARRA","GUADALAJARA DE BUGA","CARURU","SANTA ROSALIA"]
["ANTIOQUIA_","LA PEDRERA","AMAGA",null,null,"ARJONA","BELEN","ANSERMA","BELEN DE LOS ANDAQUIES",null,"BALBOA",null,"ACANDÍ","BUENAVISTA","ANAPOIMA","MAPIRIPANA","EL RETORNO","AIPE",null,null,"CABUYARO","ALDANA",null,"CACOTA",null,"CALARCA","BALBOA",null,"ARATOCA","COLOSO","ALVARADO","CALIMA","PACOA","CUMARIBO"]
["ARAUCA_","LA VICTORIA","AMALFI",null,null,"ARROYOHONDO","BETEITIVA","ARANZAZU","CARTAGENA DEL CHAIRA",null,"BOLÍVAR",null,"MEDIO BAUDÓ","CANALETE","ANOLAIMA","SAN FELIPE","MIRAFLORES","ALGECIRAS",null,null,"CUMARAL","ANCUYA",null,"CACHIRA",null,"CIRCASIA","BELEN DE UMBRIA",null,"BARBOSA","CHALAN","AMBALEMA","YOTOCO","TARAIRA"]
["ATLÁNTICO_","MIRITI - PARANÁ","ANDES",null,null,"BARRANCO DE LOBA","BOAVITA","BELALCAZAR","CURILLO",null,"BUENOS AIRES",null,"SAN JOSÉ DEL PALMAR","CHINU","ARBELAEZ","PUERTO COLOMBIA",null,"ALTAMIRA",null,null,"EL CALVARIO","ARBOLEDA",null,"CHINACOTA",null,"CÓRDOBA","GUATICA",null,"BARICHARA","EL ROBLE","ANZOATEGUI","YUMBO","PAPUNAUA"]
["BOLÍVAR_","PUERTO ALEGRÍA","ANGELOPOLIS",null,null,"CICUCO","BOYACÁ.","CHINCHINA","EL DONCELLO",null,"CAJIBIO",null,"UNIÓN PANAMERICANA","COTORRA","BELTRAN","LA GUADALUPE",null,"BARAYA",null,null,"EL CASTILLO","BARBACOAS",null,"DURANIA",null,"FILANDIA","LA CELIA",null,"BETULIA","GALERAS","ARMERO (GUAYABAL)","ZARZAL","YAVARATÉ"]
["BOYACÁ_","PUERTO ARICA","SANTAFE DE ANTIOQUIA",null,null,"CÓRDOBA","BRICEÑO","FILADELFIA","PAUJIL",null,"CALOTO",null,"MEDIO SAN JUAN","LA APARTADA","BITUIMA","CACAHUAL",null,"COLOMBIA",null,null,"EL DORADO","BELEN",null,"EL CARMEN",null,"GENOVA","MARSELLA",null,"CALIFORNIA","GUARANDA","ATACO"]
["CALDAS_","PUERTO NARIÑO","ANZA",null,null,"CLEMENCIA","BUENAVISTA","LA DORADA","LA MONTAÑITA",null,"EL TAMBO",null,null,"LOS CÓRDOBAS","BOJACA","PANA PANA",null,"GARZON",null,null,"FUENTE DE ORO","BUESACO",null,"EL ZULIA",null,"LA TEBAIDA","MISTRATO",null,"CAPITANEJO","LA UNION","CAJAMARCA"]
["CAQUETÁ_","PUERTO_SANTANDER","ARBOLETES",null,null,"EL GUAMO","CALDAS","LA MERCED","MILAN",null,"FLORENCIA",null,null,"MOÑITOS","CABRERA","MORICHAL",null,"GIGANTE",null,null,"GRANADA","CÓRDOBA",null,"HACARI",null,"MONTENEGRO","PUEBLO RICO",null,"CARCASI","LOS PALMITOS","CASABIANCA"]
["CASANARE_","TARAPACÁ","ARGELIA",null,null,"EL PEÑON","CAMPOHERMOSO","MANZANARES","MORELIA",null,"GUACHENE",null,null,"PLANETA RICA","CACHIPAY",null,null,"GUADALUPE",null,null,"GUAMAL","CUASPUD-CARLOSAMA",null,"HERRAN",null,"PIJAO","QUINCHIA",null,"CERRITO","MAJAGUAL","COELLO"]
["CAUCA_",null,"ARMENIA",null,null,"MAHATES","CHINAVITA","MARMATO","PUERTO RICO",null,"GUAPI",null,null,"PUEBLO NUEVO","CAJICA",null,null,"IQUIRA",null,null,"MAPIRIPAN","CUMBAL",null,"LABATECA",null,"QUIMBAYA","SANTA ROSA DE CABAL",null,"CHARALA","MORROA","COYAIMA"]
["CESAR_",null,"BETULIA",null,null,"MARIA LA BAJA","CHIQUINQUIRA","MARQUETALIA","SAN JOSE DEL FRAGUA",null,"INZA",null,null,"PUERTO ESCONDIDO","CAPARRAPI",null,null,"LA ARGENTINA",null,null,"MESETAS","CHACHAGUI",null,"LA ESPERANZA",null,"SALENTO","SANTUARIO",null,"CHIMA","SAN ANTONIO DE PALMITO","CUNDAY"]
["CHOCÓ_",null,"BRICEÑO",null,null,"MONTECRISTO","CHISCAS","MARULANDA","SAN VICENTE DEL CAGUAN",null,"JAMBALO",null,null,"PUERTO LIBERTADOR","CAQUEZA",null,null,"LA PLATA",null,null,"LA URIBE","EL PEÑOL",null,"LOS PATIOS",{"$nulls":4},"CHIPATA","SAMPUES","ESPINAL"]
["CÓRDOBA_",null,"BURITICA",null,null,"MOMPOS","CHITARAQUE","NEIRA","SOLANO",null,"LA SIERRA",null,null,"SAN BERNARDO DEL VIENTO","CARMEN DE CARUPA",null,null,"NATAGA",null,null,"LEJANIAS","EL ROSARIO",null,"LOURDES",{"$nulls":4},"CIMITARRA","SAN BENITO ABAD","FALAN"]
["CUNDINAMARCA_",null,"CACERES",null,null,"NOROSI","CIENEGA","NORCASIA","SOLITA ",null,"LA VEGA",null,null,"SAN PELAYO","CHAGUANI",null,null,"OPORAPA",null,null,"PUERTO CONCORDIA","EL TABLON",null,"PAMPLONA",{"$nulls":4},"CONCEPCION","SAN MARCOS","FLANDES"]
["GUAINÍA_",null,"CAICEDO",null,null,"PINILLOS","COMBITA","PACORA","VALPARAÍSO",null,"LOPEZ DE MICAY",null,null,"TIERRALTA","CHIPAQUE",null,null,"PAICOL",null,null,"PUERTO GAITAN","EL TAMBO",null,"PAMPLONITA",{"$nulls":4},"CONFINES","SAN ONOFRE","FRESNO"]
["GUAVIARE_",null,"CAMPAMENTO",null,null,"REGIDOR","CORRALES","PALESTINA",null,null,"MERCADERES",null,null,"VALENCIA","CHOACHI",null,null,"PALERMO",null,null,"PUERTO LOPEZ","FUNES",null,"PUERTO SANTANDER",{"$nulls":4},"CONTRATACION","SINCE","GUAMO"]
["HUILA_",null,"CAÑASGORDAS",null,null,"RIO VIEJO","COVARACHIA","PENSILVANIA",null,null,"MORALES",null,null,null,"CHOCÓNTA",null,null,"PITAL",null,null,"PUERTO LLERAS","GUACHUCAL",null,"SALAZAR DE LAS PALMAS",{"$nulls":4},"COROMORO","SUCRE.","HERVEO"]
["LA_GUAJIRA_",null,"CARACOLI",null,null,"SAN CRISTOBAL","CUBARA","RIOSUCIO",null,null,"PADILLA",null,null,null,"CUCUNUBA",null,null,"PITALITO",null,null,"PUERTO RICO","GUALMATAN",null,"SAN CAYETANO",{"$nulls":4},"CURITI","TOLU","HONDA"]
["MAGDALENA_",null,"CAREPA",null,null,"SAN ESTANISLAO","CUCAITA","RISARALDA",null,null,"PAEZ (BELALCAZAR",null,null,null,"EL COLEGIO",null,null,"RIVERA",null,null,"SAN CARLOS DE GUAROA","GUAITARILLA",null,"SANTIAGO",{"$nulls":4},"EL CARMEN DE CHUCURI","TOLUVIEJO","ICONONZO"]
["META_",null,"CAROLINA",null,null,"SAN JACINTO","CHIQUIZA","SALAMINA",null,null,"PATIA (EL BORDO)",null,null,null,"EL PEÑON",null,null,"SALADOBLANCO",null,null,"SAN JUAN DE ARAMA","IMUES",null,"SILOS",{"$nulls":4},"EL PEÑON",null,"LIBANO"]
["NARIÑO_",null,"CAUCASIA",null,null,"SAN JACINTO DEL CAUCA","CHIVOR","SAMANA",null,null,"PIAMONTE",null,null,null,"EL ROSAL",null,null,"SAN AGUSTIN",null,null,null,"IPIALES",null,"TIBU",{"$nulls":4},"EL PLAYON",null,"MARIQUITA"]
["NEIVA_",null,"CISNEROS",null,null,"SAN JUAN DE NEPOMUCENO","DUITAMA","SAN JOSE",null,null,"PIENDAMO",null,null,null,"FACATATIVA",null,null,"SANTA MARIA",null,null,null,"LA CRUZ",null,"TOLEDO",{"$nulls":4},"ENCINO",null,"MELGAR"]
["NORTE_DE_SANTANDER_",null,"CONCORDIA",null,null,"SANTA CATALINA","EL COCUY","SUPIA",null,null,"PUERTO TEJADA",null,null,null,"FOMEQUE",null,null,"TARQUI",null,null,null,"LA LLANADA",null,"VILLACARO",{"$nulls":4},"ENCISO",null,"MURILLO"]
["PUTUMAYO_",null,"DON MATIAS",null,null,"SANTA ROSA DEL SUR","EL ESPINO","VICTORIA",null,null,"PURACE",null,null,null,"FOSCA",null,null,"ISNOS",null,null,null,"LA UNION",null,"VILLA DEL ROSARIO",{"$nulls":4},"FLORIAN",null,"NATAGAIMA"]
["QUINDIO_",null,"EL BAGRE",null,null,"SIMITI","FIRAVITOBA","VILLAMARIA",null,null,"ROSAS",null,null,null,"FUQUENE",null,null,"PALESTINA",null,null,null,"LINARES",{"$nulls":6},"FLORIDABLANCA",null,"ORTEGA"]
["RISARALDA_",null,"EL PEÑOL",null,null,"SOPLAVIENTO","GACHANTIVA","VITERBO",null,null,"SAN SEBASTIAN",null,null,null,"FUSAGASUGA",null,null,"SUAZA",null,null,null,"LOS ANDES",{"$nulls":6},"GALAN",null,"PALOCABILDO"]
["SAN_ANDRÉS_",null,"FREDONIA",null,null,"TALAIGUA NUEVO","GARAGOA",null,null,null,"SANTANDER DE QUILICHAO",null,null,null,"GACHALA",null,null,"TESALIA",null,null,null,"MALLAMA",{"$nulls":6},"GIRON",null,"PIEDRAS"]
["SANTANDER_",null,"FRONTINO",null,null,"TIQUISIO","GUACAMAYAS",null,null,null,"SANTA ROSA",null,null,null,"GACHANCIPA",null,null,"TELLO",null,null,null,"MOSQUERA",{"$nulls":6},"GUACA",null,"PLANADAS"]
["SUCRE_",null,"GIRALDO",null,null,"TURBACO","GUAYATA",null,null,null,"SILVIA",null,null,null,"GACHETA",null,null,"TERUEL",null,null,null,"NARIÑO.",{"$nulls":6},"GUADALUPE",null,"PRADO"]
["TOLIMA_",null,"GOMEZ PLATA",null,null,"VILLANUEVA","GUICAN",null,null,null,"SOTARA",null,null,null,"GAMA",null,null,"TIMANA",null,null,null,"OSPINA",{"$nulls":6},"GUAVATA",null,"PURIFICACION"]
["VALLE_DEL_CAUCA_",null,"GUATAPÉ",null,null,null,"IZA",null,null,null,"SUAREZ",null,null,null,"GIRARDOT",null,null,"VILLAVIEJA",null,null,null,"POLICARPA",{"$nulls":6},"GUEPSA",null,"RIOBLANCO"]
["VAUPÉS_",null,"HELICONIA",null,null,null,"JERICO",null,null,null,"TIMBIO",null,null,null,"GRANADA",{"$nulls":6},"POTOSI",{"$nulls":6},"HATO",null,"RONCESVALLES"]
["VICHADA_",null,"HISPANIA",null,null,null,"LABRANZAGRANDE",null,null,null,"TIMBIQUI",null,null,null,"GUACHETA",{"$nulls":6},"PUERRES",{"$nulls":6},"JESUS MARIA",null,"ROVIRA"]
[null,null,"ITUANGO",null,null,null,"LA UVITA",null,null,null,"TORIBIO",null,null,null,"GUADUAS",{"$nulls":6},"PUPIALES",{"$nulls":6},"LA BELLEZA",null,"SALDAÑA"]
[null,null,"JARDIN",null,null,null,"VILLA DE LEYVA",null,null,null,"TOTORO",null,null,null,"GUASCA",{"$nulls":6},"RICAURTE",{"$nulls":6},"LA PAZ",null,"SAN ANTONIO"]
[null,null,"JERICO",null,null,null,"MACANAL",{"$nulls":7},"GUATAQUI",{"$nulls":6},"ROBERTO PAYAN",{"$nulls":6},"LEBRIJA",null,"SAN LUIS"]
[null,null,"LA CEJA",null,null,null,"MARIPI",{"$nulls":7},"GUATAVITA",{"$nulls":6},"SANDONA",{"$nulls":6},"LOS SANTOS",null,"SANTA ISABEL"]
[null,null,"LA PINTADA",null,null,null,"MIRAFLORES",{"$nulls":7},"GUAYABAL DE SIQUIMA",{"$nulls":6},"SAN BERNARDO",{"$nulls":6},"MACARAVITA",null,"SUAREZ"]
[null,null,"LA UNIÓN",null,null,null,"MONGUI",{"$nulls":7},"GUAYABETAL",{"$nulls":6},"SAN LORENZO",{"$nulls":6},"MALAGA",null,"VALLE DE S JUAN"]
[null,null,"LIBORINA",null,null,null,"MUZO",{"$nulls":7},"GUTIERREZ",{"$nulls":6},"SAN PABLO",{"$nulls":6},"MATANZA",null,"VENADILLO"]
[null,null,"MACEO",null,null,null,"NOBSA",{"$nulls":7},"JERUSALEN",{"$nulls":6},"SAN PEDRO DE CARTAGO",{"$nulls":6},"MOGOTES",null,"VILLAHERMOSA"]
[null,null,"MONTEBELLO",null,null,null,"NUEVO COLON",{"$nulls":7},"JUNIN",{"$nulls":6},"CONTADERO",{"$nulls":6},"MOLAGAVITA",null,"VILLARRICA"]
[null,null,"MURINDO",null,null,null,"OICATA",{"$nulls":7},"LA CALERA",{"$nulls":6},"LA FLORIDA",{"$nulls":6},"OCAMONTE"]
[null,null,"MUTATÁ",null,null,null,"OTANCHE",{"$nulls":7},"LA MESA",{"$nulls":6},"TAMINANGO",{"$nulls":6},"OIBA"]
[null,null,"NARIÑO",null,null,null,"PACHAVITA",{"$nulls":7},"LA PALMA",{"$nulls":6},"SANTA CRUZ",{"$nulls":6},"PALMAR"]
[null,null,"NECOCLI",null,null,null,"PAEZ",{"$nulls":7},"LA PEÑA",{"$nulls":6},"SAPUYES",{"$nulls":6},"PALMAS DEL SOCORRO"]
[null,null,"NECHI",null,null,null,"PAIPA",{"$nulls":7},"LA VEGA",{"$nulls":6},"TANGUA",{"$nulls":6},"PARAMO"]
[null,null,"OLAYA",null,null,null,"PAJARITO",{"$nulls":7},"LENGUAZAQUE",{"$nulls":6},"TUMACO",{"$nulls":6},"PINCHOTE"]
[null,null,"PUEBLORRICO",null,null,null,"PAUNA",{"$nulls":7},"MACHETA",{"$nulls":6},"TUQUERRES",{"$nulls":6},"PUENTE NACIONAL"]
[null,null,"PUERTO BERRIO",null,null,null,"PAYA",{"$nulls":7},"MADRID",{"$nulls":6},"YACUANQUER",{"$nulls":6},"PUERTO PARRA"]
[null,null,"PUERTO NARE",null,null,null,"PAZ DEL RIO",{"$nulls":7},"MANTA",{"$nulls":6},"ILES",{"$nulls":6},"RIONEGRO"]
[null,null,"PUERTO TRIUNFO",null,null,null,"PESCA",{"$nulls":7},"MEDINA",{"$nulls":6},"PROVIDENCIA",{"$nulls":6},"SABANA DE TORRES"]
[null,null,"REMEDIOS",null,null,null,"QUIPAMA",{"$nulls":7},"MOSQUERA",{"$nulls":13},"SAN ANDRES"]
[null,null,"SABANALARGA",null,null,null,"RAMIRIQUI",{"$nulls":7},"NARIÑO",{"$nulls":13},"SAN GIL"]
[null,null,"SALGAR",null,null,null,"RAQUIRA",{"$nulls":7},"NEMOCON",{"$nulls":13},"SAN JOAQUIN"]
[null,null,"SAN ANDRÉS",null,null,null,"RONDON",{"$nulls":7},"NILO",{"$nulls":13},"SAN VICENTE DE CHUCURI"]
[null,null,"SAN CARLOS",null,null,null,"SABOYA",{"$nulls":7},"NIMAIMA",{"$nulls":13},"GÁMBITA"]
[null,null,"SAN FRANCISCO",null,null,null,"SACHICA",{"$nulls":7},"NOCAIMA",{"$nulls":13},"SAN BENITO"]
[null,null,"SAN JERONIMO",null,null,null,"SAMACA",{"$nulls":7},"VENECIA (OSPINA PEREZ)",{"$nulls":13},"SUAITA"]
[null,null,"SAN JOSE DE LA MONTAÑA",null,null,null,"SAN EDUARDO",{"$nulls":7},"PACHO",{"$nulls":13},"SOCORRO"]
[null,null,"SAN JUAN DE URABA",null,null,null,"SAN JOSE DE PARE",{"$nulls":7},"PAIME",{"$nulls":13},"SUCRE"]
[null,null,"SAN LUIS",null,null,null,"SAN LUIS DE GACENO",{"$nulls":7},"PANDI",{"$nulls":13},"SURATA"]
[null,null,"SAN RAFAEL",null,null,null,"SAN MATEO",{"$nulls":7},"PARATEBUENO",{"$nulls":13},"TONA"]
[null,null,"SAN ROQUE",null,null,null,"SAN MIGUEL DE SEMA",{"$nulls":7},"PASCA",{"$nulls":13},"VELEZ"]
[null,null,"SAN VICENTE DE FERRER",null,null,null,"SAN PABLO DE BORBUR",{"$nulls":7},"PUERTO SALGAR",{"$nulls":13},"VETAS"]
[null,null,"SANTA BARBARA",null,null,null,"SANTANA",{"$nulls":7},"PULI",{"$nulls":13},"VILLANUEVA"]
[null,null,"SANTA ROSA DE OSOS",null,null,null,"SANTA ROSA DE VITERBO",{"$nulls":7},"QUEBRADANEGRA",{"$nulls":13},"ZAPATOCA"]
[null,null,"SANTUARIO",null,null,null,"SANTA SOFIA",{"$nulls":7},"QUETAME"]
[null,null,"SEGOVIA",null,null,null,"SOATA",{"$nulls":7},"QUIPILE"]
[null,null,"SONSON",null,null,null,"SOCOTA",{"$nulls":7},"APULO"]
[null,null,"TARSO",null,null,null,"SOGAMOSO",{"$nulls":7},"RICAURTE"]
[null,null,"TOLEDO",null,null,null,"SORA",{"$nulls":7},"SAN  ANTONIO DEL  TEQUENDAMA"]
[null,null,"TITIRIBI",null,null,null,"SOTAQUIRA",{"$nulls":7},"SAN BERNARDO"]
[null,null,"URAMITA",null,null,null,"SORACA",{"$nulls":7},"SAN CAYETANO"]
[null,null,"URRAO",null,null,null,"SUTAMARCHAN",{"$nulls":7},"SAN FRANCISCO"]
[null,null,"ANORÍ",null,null,null,"SUTATENZA",{"$nulls":7},"SAN JUAN DE RIOSECO"]
[null,null,"CIUDAD BOLIVAR",null,null,null,"TASCO",{"$nulls":7},"SASAIMA"]
[null,null,"VALDIVIA",null,null,null,"TENZA",{"$nulls":7},"SESQUILE"]
{"$rows_left_out":31}