{"text_format":"2","workbook":"xlsx","n_sheets":4,"sheets":["SOLICITUD DE CDR","DANE","LISTADOS","INSTRUCTIVO SOLICITUD "],"not_rendered":{"charts":0,"images":1,"macros":0,"external_links":0,"defined_names":40,"comments":1,"pivot_tables":0},"unopened":[],"bounds":{"document_bytes":16777216,"sheet_cells":100000,"run_cost":"one","rows_first":2000,"rows_last":500,"rows_between":2000,"halvings":0,"cell_chars":16384,"cell_head_chars":4096},"cells_cut":0,"cells_raw":0,"read":"whole","date_system":"1900"}

{"sheet":"SOLICITUD DE CDR","index":0,"n_rows":54,"n_cols":12,"rows_kept":54,"cut":false,"hidden":false,"merged":[[22,1,25,1],[26,0,29,0],[40,1,40,11],[22,3,25,4],[26,3,29,4],[30,3,33,4],[36,0,36,11],[30,0,33,0],[38,1,38,11],[30,1,33,1],[39,1,39,11],[30,7,33,7],[26,1,29,1],[18,3,21,4],[18,1,21,1],[18,5,21,6],[1,0,1,7],[2,0,3,7],[4,0,5,7],[18,0,21,0],[18,2,21,2],[18,7,21,7],[1,8,5,11],[15,5,17,6],[7,0,7,11],[9,0,9,9],[10,0,10,9],[12,0,13,11],[15,11,17,11],[15,1,17,1],[15,2,17,2],[15,7,17,7],[15,0,17,0],[15,8,15,10],[15,3,17,4],[50,0,50,11],[22,2,25,2],[26,2,29,2],[30,2,33,2],[41,1,41,11],[44,4,44,9],[45,4,45,9],[22,5,25,6],[26,5,29,6],[30,5,33,6],[46,4,46,9],[47,4,47,9],[26,7,29,7],[22,7,25,7],[22,0,25,0],[34,0,34,6],[53,4,53,6],[53,0,53,3],[51,0,51,6],[51,7,52,11],[53,7,53,11]]}
[]
[{"$nulls":8},"RADICACION"]
["PATRIMONIO AUTÓNOMO FIA"]
[]
["FORMATO SOLICITUD  DE CERTIFICADOS DE DISPONIBILIDAD DE RECURSOS - CDR"]
[]
[]
["1. INFORMACIÓN BÁSICA"]
[]
["PDA DEL DEPARTAMENTO DE:  ",{"$nulls":9},"FECHA -  (DD/MM/AAAA): "]
["--------------",{"$nulls":9},"No SOLICITUD"]
[]
["2.  PROYECTOS APROBADOS POR EL COMITÉ DIRECTIVO DEL - PDA"]
[]
[]
["No","COMPONENTE","TIPO DE GASTO","DESCRIPCIÓN    \nINVERSIÓN / PROYECTO",null,"DOCUMENTO SOPORTE DE APROBACIÓN",null,"VALOR TOTAL $","ORIGEN DE LOS RECURSOS",null,null,"FUENTE DE RECURSOS"]
[]
[{"$nulls":8},"ENTE TERRITORIAL","DPTO, MUNICIPIO O ANM","VALOR"]
[1,{"$nulls":6},{"$f":"SUM(K19:K22)","v":0},{"$f":"IFERROR(IF(J19=$A$11,\"DEPARTAMENTO\",VLOOKUP(J19,DANE!$B$3:$C$763,2,)),\"\")","v":""}]
[{"$nulls":8},{"$f":"IFERROR(IF(J20=$A$11,\"DEPARTAMENTO\",VLOOKUP(J20,DANE!$B$3:$C$763,2,)),\"\")","v":""}]
[{"$nulls":8},{"$f":"IFERROR(IF(J21=$A$11,\"DEPARTAMENTO\",VLOOKUP(J21,DANE!$B$3:$C$763,2,)),\"\")","v":""}]
[{"$nulls":8},{"$f":"IFERROR(IF(J22=$A$11,\"DEPARTAMENTO\",VLOOKUP(J22,DANE!$B$3:$C$763,2,)),\"\")","v":""}]
[2,{"$nulls":6},{"$f":"SUM(K23:K26)","v":0},{"$f":"IFERROR(IF(J23=$A$11,\"DEPARTAMENTO\",VLOOKUP(J23,DANE!$B$3:$C$763,2,)),\"\")","v":""}]
[{"$nulls":8},{"$f":"IFERROR(IF(J24=$A$11,\"DEPARTAMENTO\",VLOOKUP(J24,DANE!$B$3:$C$763,2,)),\"\")","v":""}]
[{"$nulls":8},{"$f":"IFERROR(IF(J25=$A$11,\"DEPARTAMENTO\",VLOOKUP(J25,DANE!$B$3:$C$763,2,)),\"\")","v":""}]
[{"$nulls":8},{"$f":"IFERROR(IF(J26=$A$11,\"DEPARTAMENTO\",VLOOKUP(J26,DANE!$B$3:$C$763,2,)),\"\")","v":""}]
[3,{"$nulls":6},{"$f":"SUM(K27:K30)","v":0},{"$f":"IFERROR(IF(J27=$A$11,\"DEPARTAMENTO\",VLOOKUP(J27,DANE!$B$3:$C$763,2,)),\"\")","v":""}]
[{"$nulls":8},{"$f":"IFERROR(IF(J28=$A$11,\"DEPARTAMENTO\",VLOOKUP(J28,DANE!$B$3:$C$763,2,)),\"\")","v":""}]
[{"$nulls":8},{"$f":"IFERROR(IF(J29=$A$11,\"DEPARTAMENTO\",VLOOKUP(J29,DANE!$B$3:$C$763,2,)),\"\")","v":""}]
[{"$nulls":8},{"$f":"IFERROR(IF(J30=$A$11,\"DEPARTAMENTO\",VLOOKUP(J30,DANE!$B$3:$C$763,2,)),\"\")","v":""}]
[4,{"$nulls":6},{"$f":"SUM(K31:K34)","v":0},{"$f":"IFERROR(IF(J31=$A$11,\"DEPARTAMENTO\",VLOOKUP(J31,DANE!$B$3:$C$763,2,)),\"\")","v":""}]
[{"$nulls":8},{"$f":"IFERROR(IF(J32=$A$11,\"DEPARTAMENTO\",VLOOKUP(J32,DANE!$B$3:$C$763,2,)),\"\")","v":""}]
[{"$nulls":8},{"$f":"IFERROR(IF(J33=$A$11,\"DEPARTAMENTO\",VLOOKUP(J33,DANE!$B$3:$C$763,2,)),\"\")","v":""}]
[{"$nulls":8},{"$f":"IFERROR(IF(J34=$A$11,\"DEPARTAMENTO\",VLOOKUP(J34,DANE!$B$3:$C$763,2,)),\"\")","v":""}]
["TOTAL",{"$nulls":6},{"$f":"SUM(H19:H34)","v":0}]
[]
["Con base en lo señalado en el Decreto 2246 de 2012, que derogó el Decreto 3200 de 2008, por el cual se dictan las normas sobre los Planes Departamentales para el Manejo Empresarial de los Servicios de Agua y Saneamiento - PDA y se dictan otras disposiciones, Declaramos que:  "]
[]
["1.","Los Proyectos relacionados anteriormente, han sido priorizados por parte del Comité Directivo del PDA, dentro del Plan Estratégico de Inversiones, y han sido aprobados en forma definitiva para iniciar el proceso de contratación, con el voto favorable del Delegado del MVCT y del Representante Legal del Departamento (Gobernador del Departamento.)"]
["2.","Los Proyectos aprobados por el Comité Directivo del PDA, dentro del Plan Estratégico de Inversiones, se encuentran  viabilizados a través del mecanismo de Ventanilla Unica, ó del mecanismo Departamental de Viabilización de Proyectos "]
["3.","Previamente se han establecido los lineamientos y parámetros generales de contratación aprobados por el Comité Directivo del PDA,  con el voto favorable del Delegado del MVCT y del Representante Legal del Departamento (Gobernador del Departamento), velando por la pluralidad de oferentes y la publicidad de dichos procesos."]
["4.","Los suscriptores de la presente solicitud, certifican que la documentación presentada ante el Consorcio FIA, como debido soporte de la aprobación de los Proyectos relacionados anteriormente, para el trámite de expedición de los Certificados de Disponibilidad de Recursos, es veraz, por lo cual ante cualquier inconsistencia en la misma, responderán ante los organismos de control del Estado, por cualquier inexactitud o falsedad en la información, que pueda ocasionar un detrimento patrimonial de los recursos del Estado o perjuicio a la comunidad."]
[]
[]
[null,null,null,"FIRMA"]
[null,null,null,"NOMBRE"]
[{"$nulls":4},"Representante Legal del Fideicomitente o Gestor"]
[{"$nulls":4},{"$f":"CONCATENATE(\"PDA- DEPARTAMENTO DE \",A11)","v":"PDA- DEPARTAMENTO DE --------------"}]
[]
[]
["PARA USO EXCLUSIVO DEL CONSORCIO FIA"]
["P.A. FIA - PROCESO CDR'S\nVisado de Firmas"]
[]
["Fecha:___________________________________",null,null,null,"Firma Responsable:__________________________________",null,null,"Vo. Bo. Analista Senior de Presupuesto"]

{"sheet":"DANE","index":1,"n_rows":763,"n_cols":18,"rows_kept":763,"cut":false,"hidden":true,"merged":[[0,5,0,6]]}
["DANE","MUNICIPIO","DPTO/MPIO","DEPARTAMENTO",null,"TIPO DE GASTO",{"$nulls":11},"NEIVA"]
[91000,null,"Departamento","AMAZONAS",null,"COMPONENTE","SUBCOMPONENTE"]
[91263,"EL ENCANTO","ANM","AMAZONAS",null,"Infraestructura en Agua y Saneamiento","Pre-Inversión"]
[91405,"LA CHORRERA","ANM","AMAZONAS",null,"Desarrollo Institucional","Inversión"]
[91407,"LA PEDRERA","ANM","AMAZONAS",null,"Proyectos Ambientales","Interventoría"]
[91430,"LA VICTORIA","ANM","AMAZONAS",null,"Desarrollo sector rural","Estructura Operativa"]
[91460,"MIRITI - PARANÁ","ANM","AMAZONAS",null,"Comunidades Indigenas/afrocolombianas","Otros"]
[91530,"PUERTO ALEGRÍA","ANM","AMAZONAS",null,"Gestión del Riesgo Sectorial","Servicio a la Deuda"]
[91536,"PUERTO ARICA","ANM","AMAZONAS",null,"Compromisos Financieros"]
[91540,"PUERTO NARIÑO","Municipio","AMAZONAS"]
[91669,"PUERTO_SANTANDER","ANM","AMAZONAS",null,"FUENTE DE RECURSOS"]
[91798,"TARAPACÁ","ANM","AMAZONAS",null,"SGP Agua potable y Saneamiento basico"]
[5000,null,"Departamento","ANTIOQUIA",null,"Regalías Directas"]
[5002,"ABEJORRAL","Municipio","ANTIOQUIA",null,"Regalías SGR - Fondo Compensación Regional"]
[5021,"ALEJANDRÍA","Municipio","ANTIOQUIA",null,"Regalías SGR - Fondo Desarrollo Regional"]
[5030,"AMAGA","Municipio","ANTIOQUIA",null,"Nación (Audiencias Públicas)"]
[5031,"AMALFI","Municipio","ANTIOQUIA",null,"Nación (Proyectos Estratégicos)"]
[5034,"ANDES","Municipio","ANTIOQUIA",null,"Recursos CAR"]
[5036,"ANGELOPOLIS","Municipio","ANTIOQUIA",null,"Otros Recursos"]
[5042,"SANTAFE DE ANTIOQUIA","Municipio","ANTIOQUIA",null,"Banco Mundial"]
[5040,"ANORÍ","Municipio","ANTIOQUIA",null,"Contrato Plan SGP"]
[5044,"ANZA","Municipio","ANTIOQUIA",null,"Contrato Plan Nación"]
[5051,"ARBOLETES","Municipio","ANTIOQUIA",null,"Contrato Plan Regalías"]
[5055,"ARGELIA","Municipio","ANTIOQUIA",null,"Crédito BID"]
[5059,"ARMENIA","Municipio","ANTIOQUIA",null,"Recursos Crédito"]
[5093,"BETULIA","Municipio","ANTIOQUIA",null,"Nación Compromiso por Colombia"]
[5107,"BRICEÑO","Municipio","ANTIOQUIA"]
[5113,"BURITICA","Municipio","ANTIOQUIA"]
[5120,"CACERES","Municipio","ANTIOQUIA"]
[5125,"CAICEDO","Municipio","ANTIOQUIA"]
[5134,"CAMPAMENTO","Municipio","ANTIOQUIA"]
[5138,"CAÑASGORDAS","Municipio","ANTIOQUIA"]
[5142,"CARACOLI","Municipio","ANTIOQUIA"]
[5147,"CAREPA","Municipio","ANTIOQUIA"]
[5150,"CAROLINA","Municipio","ANTIOQUIA"]
[5154,"CAUCASIA","Municipio","ANTIOQUIA"]
[5190,"CISNEROS","Municipio","ANTIOQUIA"]
[5101,"CIUDAD BOLIVAR","Municipio","ANTIOQUIA"]
[5209,"CONCORDIA","Municipio","ANTIOQUIA"]
[5237,"DON MATIAS","Municipio","ANTIOQUIA"]
[5541,"EL PEÑOL","Municipio","ANTIOQUIA"]
[5250,"EL BAGRE","Municipio","ANTIOQUIA"]
[5282,"FREDONIA","Municipio","ANTIOQUIA"]
[5284,"FRONTINO","Municipio","ANTIOQUIA"]
[5306,"GIRALDO","Municipio","ANTIOQUIA"]
[5310,"GOMEZ PLATA","Municipio","ANTIOQUIA"]
[5321,"GUATAPÉ","Municipio","ANTIOQUIA"]
[5347,"HELICONIA","Municipio","ANTIOQUIA"]
[5353,"HISPANIA","Municipio","ANTIOQUIA"]
[5361,"ITUANGO","Municipio","ANTIOQUIA"]
[5364,"JARDIN","Municipio","ANTIOQUIA"]
[5368,"JERICO","Municipio","ANTIOQUIA"]
[5376,"LA CEJA","Municipio","ANTIOQUIA"]
[5390,"LA PINTADA","Municipio","ANTIOQUIA"]
[5400,"LA UNIÓN","Municipio","ANTIOQUIA"]
[5411,"LIBORINA","Municipio","ANTIOQUIA"]
[5425,"MACEO","Municipio","ANTIOQUIA"]
[5467,"MONTEBELLO","Municipio","ANTIOQUIA"]
[5475,"MURINDO","Municipio","ANTIOQUIA"]
[5480,"MUTATÁ","Municipio","ANTIOQUIA"]
{"$rows_left_out":704}
{"sheet":"LISTADOS","index":2,"n_rows":111,"n_cols":34,"rows_kept":111,"cut":false,"hidden":true,"merged":[]}
["DEPARTAMENTO","AMAZONAS","ANTIOQUIA","ARAUCA","ATLÁNTICO","BOLÍVAR","BOYACÁ","CALDAS","CAQUETÁ","CASANARE","CAUCA","CESAR","CHOCÓ","CÓRDOBA","CUNDINAMARCA","GUAINÍA","GUAVIARE","HUILA","LA_GUAJIRA","MAGDALENA","META","NARIÑO","NEIVA","NORTE_DE_SANTANDER","PUTUMAYO","QUINDIO","RISARALDA","SAN_ANDRÉS","SANTANDER","SUCRE","TOLIMA","VALLE_DEL_CAUCA","VAUPÉS","VICHADA"]
["--------------","EL ENCANTO","ABEJORRAL",null,"PUERTO COLOMBIA","ACHI","ALMEIDA","MANIZALES","FLORENCIA",null,"POPAYAN",null,"CANTÓN DEL SAN PABLO","MONTERIA","AGUA DE DIOS","INIRIDA","SAN JOSE DEL GUAVIARE","ACEVEDO",null,null,"ACACIAS","PASTO","NEIVA.","ARBOLEDAS",null,"ARMENIA","PEREIRA","SAN ANDRÉS.","AGUADA","BUENAVISTA","IBAGUE","ANDALUCIA","MITU","LA PRIMAVERA"]
["AMAZONAS","LA CHORRERA","ALEJANDRÍA",null,null,"ARENAL","AQUITANIA","AGUADAS","ALBANIA",null,"ARGELIA",null,"RIO QUITO","AYAPEL","ALBAN","BARRANCO MINAS","CALAMAR","AGRADO",null,null,"BARRANCA DE UPIA","ALBAN",null,"BOCHALEMA",null,"BUENAVISTA","APIA","PROVIDENCIA","ALBANIA","CAIMITO","ALPUJARRA","GUADALAJARA DE BUGA","CARURU","SANTA ROSALIA"]
["ANTIOQUIA","LA PEDRERA","AMAGA",null,null,"ARJONA","BELEN","ANSERMA","BELEN DE LOS ANDAQUIES",null,"BALBOA",null,"ACANDÍ","BUENAVISTA","ANAPOIMA","MAPIRIPANA","EL RETORNO","AIPE",null,null,"CABUYARO","ALDANA",null,"CACOTA",null,"CALARCA","BALBOA",null,"ARATOCA","COLOSO","ALVARADO","CALIMA","PACOA","CUMARIBO"]
["ARAUCA","LA VICTORIA","AMALFI",null,null,"ARROYOHONDO","BETEITIVA","ARANZAZU","CARTAGENA DEL CHAIRA",null,"BOLÍVAR",null,"MEDIO BAUDÓ","CANALETE","ANOLAIMA","SAN FELIPE","MIRAFLORES","ALGECIRAS",null,null,"CUMARAL","ANCUYA",null,"CACHIRA",null,"CIRCASIA","BELEN DE UMBRIA",null,"BARBOSA","CHALAN","AMBALEMA","YOTOCO","TARAIRA"]
["ATLÁNTICO","MIRITI - PARANÁ","ANDES",null,null,"BARRANCO DE LOBA","BOAVITA","BELALCAZAR","CURILLO",null,"BUENOS AIRES",null,"SAN JOSÉ DEL PALMAR","CHINU","ARBELAEZ","PUERTO COLOMBIA",null,"ALTAMIRA",null,null,"EL CALVARIO","BARBACOAS",null,"CHINACOTA",null,"CÓRDOBA","GUATICA",null,"BARICHARA","EL ROBLE","ANZOATEGUI","YUMBO","PAPUNAUA"]
["BOLÍVAR","PUERTO ALEGRÍA","ANGELOPOLIS",null,null,"CICUCO","BOYACÁ.","CHINCHINA","EL DONCELLO",null,"CAJIBIO",null,"UNIÓN PANAMERICANA","COTORRA","BELTRAN","LA GUADALUPE",null,"BARAYA",null,null,"EL CASTILLO","BELEN",null,"DURANIA",null,"FILANDIA","MARSELLA",null,"BETULIA","GALERAS","ARMERO (GUAYABAL)","ZARZAL","YAVARATÉ"]
["BOYACÁ","PUERTO ARICA","SANTAFE DE ANTIOQUIA",null,null,"CÓRDOBA","BRICEÑO","FILADELFIA","PAUJIL",null,"CALOTO",null,null,"LA APARTADA","BITUIMA","CACAHUAL",null,"COLOMBIA",null,null,"EL DORADO","BUESACO",null,"EL CARMEN",null,"GENOVA","MISTRATO",null,"CALIFORNIA","GUARANDA","ATACO"]
["CALDAS","PUERTO NARIÑO","ANZA",null,null,"CLEMENCIA","BUENAVISTA","LA DORADA","LA MONTAÑITA",null,"EL TAMBO",null,null,"LOS CÓRDOBAS","BOJACA","PANA PANA",null,"GARZON",null,null,"FUENTE DE ORO","CÓRDOBA",null,"EL ZULIA",null,"LA TEBAIDA","PUEBLO RICO",null,"CAPITANEJO","LA UNION","CAJAMARCA"]
["CAQUETÁ","PUERTO_SANTANDER","ARBOLETES",null,null,"EL GUAMO","CALDAS","LA MERCED","MILAN",null,"GUACHENE",null,null,"MOÑITOS","CABRERA","MORICHAL",null,"GIGANTE",null,null,"GRANADA","CUASPUD-CARLOSAMA",null,"HACARI",null,"MONTENEGRO","QUINCHIA",null,"CARCASI","LOS PALMITOS","CASABIANCA"]
["CASANARE","TARAPACÁ","ARGELIA",null,null,"EL PEÑON","CAMPOHERMOSO","MANZANARES","MORELIA",null,"GUAPI",null,null,"PLANETA RICA","CACHIPAY",null,null,"GUADALUPE",null,null,"GUAMAL","CUMBAL",null,"HERRAN",null,"PIJAO","SANTA ROSA DE CABAL",null,"CERRITO","MAJAGUAL","COELLO"]
["CAUCA",null,"ARMENIA",null,null,"MAHATES","CHINAVITA","MARMATO","PUERTO RICO",null,"INZA",null,null,"PUEBLO NUEVO","CAJICA",null,null,"IQUIRA",null,null,"MAPIRIPAN","CHACHAGUI",null,"LABATECA",null,"QUIMBAYA","SANTUARIO",null,"CHARALA","MORROA","COYAIMA"]
["CESAR",null,"BETULIA",null,null,"MARIA LA BAJA","CHIQUINQUIRA","MARQUETALIA","SAN JOSE DEL FRAGUA",null,"JAMBALO",null,null,"PUERTO ESCONDIDO","CAPARRAPI",null,null,"LA ARGENTINA",null,null,"MESETAS","EL PEÑOL",null,"LA ESPERANZA",null,"SALENTO",null,null,"CHIMA","SAN ANTONIO DE PALMITO","CUNDAY"]
["CHOCÓ",null,"BRICEÑO",null,null,"MONTECRISTO","CHISCAS","MARULANDA","SAN VICENTE DEL CAGUAN",null,"LA SIERRA",null,null,"PUERTO LIBERTADOR","CAQUEZA",null,null,"LA PLATA",null,null,"LA URIBE","EL ROSARIO",null,"LOS PATIOS",{"$nulls":4},"CHIPATA","SAMPUES","ESPINAL"]
["CÓRDOBA",null,"BURITICA",null,null,"MOMPOS","CHITARAQUE","NEIRA","SOLANO",null,"LA VEGA",null,null,"SAN BERNARDO DEL VIENTO","CARMEN DE CARUPA",null,null,"NATAGA",null,null,"LEJANIAS","EL TABLON",null,"LOURDES",{"$nulls":4},"CIMITARRA","SAN BENITO ABAD","FALAN"]
["CUNDINAMARCA",null,"CACERES",null,null,"NOROSI","CIENEGA","NORCASIA","SOLITA ",null,"LOPEZ DE MICAY",null,null,"SAN PELAYO","CHAGUANI",null,null,"OPORAPA",null,null,"PUERTO CONCORDIA","EL TAMBO",null,"PAMPLONA",{"$nulls":4},"CONCEPCION","SAN MARCOS","FLANDES"]
["GUAINÍA",null,"CAICEDO",null,null,"PINILLOS","COMBITA","PACORA","VALPARAÍSO",null,"MERCADERES",null,null,"TIERRALTA","CHIPAQUE",null,null,"PAICOL",null,null,"PUERTO GAITAN","FUNES",null,"PAMPLONITA",{"$nulls":4},"CONFINES","SAN ONOFRE","FRESNO"]
["GUAVIARE",null,"CAMPAMENTO",null,null,"REGIDOR","CORRALES","PALESTINA",null,null,"MORALES",null,null,"VALENCIA","CHOACHI",null,null,"PALERMO",null,null,"PUERTO LOPEZ","GUACHUCAL",null,"PUERTO SANTANDER",{"$nulls":4},"CONTRATACION","SINCE","GUAMO"]
["HUILA",null,"CAÑASGORDAS",null,null,"RIO VIEJO","COVARACHIA","PENSILVANIA",null,null,"PADILLA",null,null,null,"CHOCÓNTA",null,null,"PITAL",null,null,"PUERTO LLERAS","GUALMATAN",null,"SALAZAR DE LAS PALMAS",{"$nulls":4},"COROMORO","SUCRE.","HERVEO"]
["LA_GUAJIRA",null,"CARACOLI",null,null,"SAN CRISTOBAL","CUBARA","RIOSUCIO",null,null,"PAEZ (BELALCAZAR",null,null,null,"CUCUNUBA",null,null,"PITALITO",null,null,"PUERTO RICO","IMUES",null,"SAN CAYETANO",{"$nulls":4},"CURITI","TOLU","HONDA"]
["MAGDALENA",null,"CAREPA",null,null,"SAN ESTANISLAO","CUCAITA","RISARALDA",null,null,"PATIA (EL BORDO)",null,null,null,"EL COLEGIO",null,null,"RIVERA",null,null,"SAN CARLOS DE GUAROA","IPIALES",null,"SANTIAGO",{"$nulls":4},"EL CARMEN DE CHUCURI","TOLUVIEJO","ICONONZO"]
["META",null,"CAROLINA",null,null,"SAN JACINTO","CHIQUIZA","SALAMINA",null,null,"PIAMONTE",null,null,null,"EL PEÑON",null,null,"SALADOBLANCO",null,null,"SAN JUAN DE ARAMA","LA CRUZ",null,"SILOS",{"$nulls":4},"EL PEÑON",null,"LIBANO"]
["NARIÑO",null,"CAUCASIA",null,null,"SAN JACINTO DEL CAUCA","CHIVOR","SAMANA",null,null,"PIENDAMO",null,null,null,"EL ROSAL",null,null,"SAN AGUSTIN",null,null,null,"LA LLANADA",null,"TIBU",{"$nulls":4},"EL PLAYON",null,"MARIQUITA"]
["NEIVA",null,"CISNEROS",null,null,"SAN JUAN DE NEPOMUCENO","DUITAMA","SAN JOSE",null,null,"PUERTO TEJADA",null,null,null,"FACATATIVA",null,null,"SANTA MARIA",null,null,null,"LA UNION",null,"TOLEDO",{"$nulls":4},"ENCINO",null,"MURILLO"]
["NORTE_DE_SANTANDER",null,"CONCORDIA",null,null,"SANTA CATALINA","EL COCUY","SUPIA",null,null,"PURACE",null,null,null,"FOMEQUE",null,null,"TARQUI",null,null,null,"LINARES",null,"VILLACARO",{"$nulls":4},"ENCISO",null,"NATAGAIMA"]
["PUTUMAYO",null,"DON MATIAS",null,null,"SANTA ROSA DEL SUR","EL ESPINO","VICTORIA",null,null,"ROSAS",null,null,null,"FOSCA",null,null,"TESALIA",null,null,null,"LOS ANDES",null,"VILLA DEL ROSARIO",{"$nulls":4},"FLORIAN",null,"ORTEGA"]
["QUINDIO",null,"EL BAGRE",null,null,"SIMITI","FIRAVITOBA","VILLAMARIA",null,null,"SAN SEBASTIAN",null,null,null,"FUQUENE",null,null,"TELLO",null,null,null,"MALLAMA",{"$nulls":6},"FLORIDABLANCA",null,"PALOCABILDO"]
["RISARALDA",null,"EL PEÑOL",null,null,"SOPLAVIENTO","GACHANTIVA","VITERBO",null,null,"SANTANDER DE QUILICHAO",null,null,null,"FUSAGASUGA",null,null,"TERUEL",null,null,null,"MOSQUERA",{"$nulls":6},"GALAN",null,"PIEDRAS"]
["SAN_ANDRÉS",null,"FREDONIA",null,null,"TALAIGUA NUEVO","GARAGOA",null,null,null,"SANTA ROSA",null,null,null,"GACHALA",null,null,"TIMANA",null,null,null,"NARIÑO.",{"$nulls":6},"GIRON",null,"PLANADAS"]
["SANTANDER",null,"FRONTINO",null,null,"TIQUISIO","GUACAMAYAS",null,null,null,"SILVIA",null,null,null,"GACHANCIPA",null,null,"VILLAVIEJA",null,null,null,"OSPINA",{"$nulls":6},"GUACA",null,"PRADO"]
["SUCRE",null,"GIRALDO",null,null,"TURBACO","GUAYATA",null,null,null,"SOTARA",null,null,null,"GACHETA",{"$nulls":6},"POLICARPA",{"$nulls":6},"GUADALUPE",null,"PURIFICACION"]
["TOLIMA",null,"GOMEZ PLATA",null,null,"VILLANUEVA","GUICAN",null,null,null,"SUAREZ",null,null,null,"GAMA",{"$nulls":6},"POTOSI",{"$nulls":6},"GUAVATA",null,"RIOBLANCO"]
["VALLE_DEL_CAUCA",null,"GUATAPÉ",null,null,null,"IZA",null,null,null,"TIMBIO",null,null,null,"GIRARDOT",{"$nulls":6},"PUERRES",{"$nulls":6},"GUEPSA",null,"RONCESVALLES"]
["VAUPÉS",null,"HELICONIA",null,null,null,"JERICO",null,null,null,"TIMBIQUI",null,null,null,"GRANADA",{"$nulls":6},"PUPIALES",{"$nulls":6},"HATO",null,"ROVIRA"]
["VICHADA",null,"HISPANIA",null,null,null,"LABRANZAGRANDE",null,null,null,"TORIBIO",null,null,null,"GUACHETA",{"$nulls":6},"RICAURTE",{"$nulls":6},"JESUS MARIA",null,"SALDAÑA"]
[null,null,"ITUANGO",null,null,null,"LA UVITA",null,null,null,"TOTORO",null,null,null,"GUADUAS",{"$nulls":6},"ROBERTO PAYAN",{"$nulls":6},"LA BELLEZA",null,"SAN ANTONIO"]
[null,null,"JARDIN",null,null,null,"VILLA DE LEYVA",{"$nulls":7},"GUASCA",{"$nulls":6},"SANDONA",{"$nulls":6},"LA PAZ",null,"SAN LUIS"]
[null,null,"JERICO",null,null,null,"MACANAL",{"$nulls":7},"GUATAQUI",{"$nulls":6},"SAN BERNARDO",{"$nulls":6},"LEBRIJA",null,"SANTA ISABEL"]
[null,null,"LA CEJA",null,null,null,"MARIPI",{"$nulls":7},"GUATAVITA",{"$nulls":6},"SAN LORENZO",{"$nulls":6},"LOS SANTOS",null,"SUAREZ"]
[null,null,"LA PINTADA",null,null,null,"MIRAFLORES",{"$nulls":7},"GUAYABAL DE SIQUIMA",{"$nulls":6},"SAN PABLO",{"$nulls":6},"MACARAVITA",null,"VALLE DE S JUAN"]
[null,null,"LA UNIÓN",null,null,null,"MONGUI",{"$nulls":7},"GUAYABETAL",{"$nulls":6},"SAN PEDRO DE CARTAGO",{"$nulls":6},"MALAGA",null,"VENADILLO"]
[null,null,"LIBORINA",null,null,null,"MUZO",{"$nulls":7},"GUTIERREZ",{"$nulls":6},"SANTA CRUZ",{"$nulls":6},"MATANZA",null,"VILLAHERMOSA"]
[null,null,"MACEO",null,null,null,"NOBSA",{"$nulls":7},"JERUSALEN",{"$nulls":6},"SAPUYES",{"$nulls":6},"MOGOTES",null,"VILLARRICA"]
[null,null,"MONTEBELLO",null,null,null,"NUEVO COLON",{"$nulls":7},"JUNIN",{"$nulls":6},"TANGUA",{"$nulls":6},"MOLAGAVITA"]
[null,null,"MURINDO",null,null,null,"OICATA",{"$nulls":7},"LA CALERA",{"$nulls":6},"TUMACO",{"$nulls":6},"OCAMONTE"]
[null,null,"MUTATÁ",null,null,null,"OTANCHE",{"$nulls":7},"LA MESA",{"$nulls":6},"TUQUERRES",{"$nulls":6},"OIBA"]
[null,null,"NARIÑO",null,null,null,"PACHAVITA",{"$nulls":7},"LA PALMA",{"$nulls":6},"YACUANQUER",{"$nulls":6},"PALMAR"]
[null,null,"NECOCLI",null,null,null,"PAEZ",{"$nulls":7},"LA PEÑA",{"$nulls":13},"PALMAS DEL SOCORRO"]
[null,null,"NECHI",null,null,null,"PAIPA",{"$nulls":7},"LA VEGA",{"$nulls":13},"PARAMO"]
[null,null,"OLAYA",null,null,null,"PAJARITO",{"$nulls":7},"LENGUAZAQUE",{"$nulls":13},"PINCHOTE"]
[null,null,"PUEBLORRICO",null,null,null,"PAUNA",{"$nulls":7},"MACHETA",{"$nulls":13},"PUENTE NACIONAL"]
[null,null,"PUERTO BERRIO",null,null,null,"PAYA",{"$nulls":7},"MADRID",{"$nulls":13},"PUERTO PARRA"]
[null,null,"PUERTO NARE",null,null,null,"PAZ DEL RIO",{"$nulls":7},"MANTA",{"$nulls":13},"RIONEGRO"]
[null,null,"PUERTO TRIUNFO",null,null,null,"PESCA",{"$nulls":7},"MEDINA",{"$nulls":13},"SABANA DE TORRES"]
[null,null,"REMEDIOS",null,null,null,"QUIPAMA",{"$nulls":7},"MOSQUERA",{"$nulls":13},"SAN ANDRES"]
[null,null,"SABANALARGA",null,null,null,"RAMIRIQUI",{"$nulls":7},"NARIÑO",{"$nulls":13},"SAN GIL"]
[null,null,"SALGAR",null,null,null,"RAQUIRA",{"$nulls":7},"NEMOCON",{"$nulls":13},"SAN JOAQUIN"]
[null,null,"SAN ANDRÉS",null,null,null,"RONDON",{"$nulls":7},"NILO",{"$nulls":13},"SAN VICENTE DE CHUCURI"]
[null,null,"SAN CARLOS",null,null,null,"SABOYA",{"$nulls":7},"NIMAIMA",{"$nulls":13},"SOCORRO"]
[null,null,"SAN FRANCISCO",null,null,null,"SACHICA",{"$nulls":7},"NOCAIMA",{"$nulls":13},"SUCRE"]
{"$rows_left_out":52}
{"sheet":"INSTRUCTIVO SOLICITUD ","index":3,"n_rows":25,"n_cols":3,"rows_kept":25,"cut":false,"hidden":false,"merged":[[0,1,0,2],[11,0,11,2]]}
[null,"INSTRUCTIVO DILIGENCIAMIENTO FORMATO SOLICITUD DE CDR´s"]
[]
[]
[]
[]
[]
["1. INFORMACIÓN BÁSICA"]
[null,"PAP - PDA DEL DEPARTAMENTO DE: ","Seleccionar en la lista desplegable, el Departamento que solicita el compromiso presupuestal"]
[null,"FECHA (DD/MM/AAAA): ","Fecha de diligenciamiento del formato"]
[null,"No. SOLICITUD:","Consecutivo del PDA "]
[]
["2. PROYECTOS APROBADOS POR EL COMITÉ DIRECTIVO DEL PAP - PDA PARA INICIAR LOS PROCESOS DE CONTRATACIÓN"]
[null,"COMPONENTE","Seleccione en la lista desplegable, el \"Componente\" conforme a lo aprobado en el PEI, el proyecto relacionado: \n* Infraestructura en Agua y Saneamiento \n* Desarrollo Institucional\n* Proyectos Ambientales\n* Desarrollo Sector Rural \n* Comunidades Indígenas/afrocolombianas\n* Gestión del Riesgo Sectorial"]
[null,"TIPO DE GASTO","Seleccione en la lista desplegable, el \"Tipo de Gasto\" por el cual fue aprobado en el PEI, el proyecto relacionado: \n* Estructura Operativa: se selecciona cuando los recursos son solicitados para los gastos del Gestor\n* Pre-inversión: Para consultorías, estudios y diseños de los proyectos\n* Inversión: Se selecciona cuando los recursos son solicitados para la ejecución de una OBRA o compra de vehículos para el desarrollo del objeto del PDA\n* Interventoría: se selecciona, cuando los recursos son destinados a la interventoría de la obra, consultoría, estudios o diseños del proyecto\n* Otros: se selecciona para los otros proyectos relacionados "]
[null,"DESCRIPCIÓN INVERSIÓN/PROYECTO","Relacione la descripción del proyecto, conforme se encuentra registrada en el documento soporte de aprobación (Acta de Comité Directivo, Carta de Viabilidad, etc). Tenga en cuenta, que el formato solo tiene capacidad hasta 300 caracteres, incluyendo espacios "]
[null,"DOCUMENTO SOPORTE DE APROBACIÓN","De acuerdo a la solicitud de cada proyecto, los documentos soportes de aprobación son los siguientes:\n* Inversión (Obra y compra de vehículos e Interventoría): Carta de Viabilidad expedida por el Ministerio de Vivienda Ciudad y Territorio o Carta de Viabilidad expedida por el Comité Técnico Departamental  \n* Pre-Inversión (Consultorías, estudios y diseños e Interventoría): Acta de Comité Directivo\n* Estructura Operativa (gastos del Gestor): Acta de Comité Directivo\n* Otros (Plan de Gestión Social, Plan de Aseguramiento, Plan Ambiental, Plan de Gestión del Riesgo):  Acta de Comité Directivo\n\n* Compra de predios y Gestión Predial: Acta de Comité Directivo"]
[null,"VALOR TOTAL $","Sumatoria automática generada, de la información registrada en las columnas de origen de recursos"]
[null,"ENTE TERRITORIAL","Se asigna automáticamente, después de seleccionar el Departamento/Municipio, de la siguiente columna"]
[null,"DPTO, MUNICIPIO O ANM","Seleccione en la lista desplegable, el nombre del Departamento, Municipio o ANM, al cual se van apropiar los recursos. Los nombres que se desplieguen en esta casilla, dependen del Departamento seleccionado en la \"INFORMACIÓN BÁSICA\""]
[null,"VALOR $","Valor apropiado para cada ente territorial, según lo aprobado en documento soporte"]
[null,"FUENTE DE RECURSOS","Seleccione en la lista desplegable, la fuente de recursos, por la cual se van apropiar los valores registrados: \n* SGP - Sistema General de Participaciones\n* Regalías Directas\n* Regalías SGR - Fondo Compensación Regional\n* Nación (Audiencias Públicas)\n* Nación (Proyectos Estratégicos)  \n* Recursos CAR\n* Otros Recursos\n* Banco Mundial\n* Contrato Plan SGP\n* Contrato Plan Nación\n* Contrato Plan Regalías\n* Crédito BID\n* Recursos Crédito"]
[]
["3. FIRMA"]
[null,"FIRMA","Se registra la firma del Representante Legal del Fideicomitente o Gestor"]
[null,"NOMBRE","Se registra el nombre del Representante Legal del Fideicomitente o Gestor \nTENGA EN CUENTA: Para el caso de los CDR por concepto de REMUNERACIÓN DEL GESTOR, la solicitud deberá ser suscrita para todos los casos, por el Gobernador del Departamento"]