{"text_format":"2","workbook":"xlsx","n_sheets":4,"sheets":["FORMATO LIBERACIÓN ","INSTRUCTIVO LIBERACIÓN","DANE","LISTADOS"],"not_rendered":{"charts":0,"images":1,"macros":0,"external_links":0,"defined_names":37,"comments":1,"pivot_tables":0},"unopened":[],"bounds":{"document_bytes":16777216,"sheet_cells":100000,"run_cost":"one","rows_first":2000,"rows_last":500,"rows_between":2000,"halvings":0,"cell_chars":16384,"cell_head_chars":4096},"cells_cut":0,"cells_raw":0,"read":"whole","date_system":"1900"}

{"sheet":"FORMATO LIBERACIÓN ","index":0,"n_rows":41,"n_cols":12,"rows_kept":41,"cut":false,"hidden":false,"merged":[[12,0,12,9],[1,0,4,8],[1,9,7,11],[5,0,6,8],[9,0,9,11],[11,0,11,9],[14,0,15,11],[17,0,19,0],[17,1,19,1],[17,2,19,2],[17,3,19,3],[17,4,19,4],[17,5,19,5],[17,6,19,6],[17,7,19,7],[17,8,19,8],[37,0,37,11],[17,9,18,10],[17,11,19,11],[27,1,27,2],[27,3,27,10],[28,1,28,2],[28,3,28,10],[29,3,29,10],[30,3,30,10],[33,1,33,11],[34,1,34,11],[35,1,35,11],[38,0,38,2],[38,3,38,5],[38,6,38,8],[38,9,38,10],[40,0,40,1],[40,3,40,4],[40,6,40,7]]}
[]
["PATRIMONIO AUTÓNOMO FIA",{"$nulls":8},"RADICACIÓN"]
[]
[]
[]
["FORMATO SOLICITUD DE LIBERACIÓN DE CERTIFICADOS DE DISPONIBILIDAD DE RECURSOS  - CDR Y/O CONTRATOS"]
[]
[]
[]
["1. INFORMACION BÁSICA"]
[]
["PDA DEL DEPARTAMENTO DE:",{"$nulls":9},"FECHA - (DD/MM/AAAA):"]
["--------------",{"$nulls":9},"No SOLICITUD"]
[]
["SALDOS DE CONTRATOS Y CDR´s POR LIBERAR"]
[]
[]
["No","No. CONTRATO","VALOR CONTRATO","NIT","CONTRATISTA","SALDO CONTRATO A LIBERAR","FECHA EXPEDICIÓN CDR","No. CDR","SALDO CDR A LIBERAR","ORIGEN DE LOS RECURSOS",null,"FUENTE DE RECURSOS"]
[]
[{"$nulls":9},"DANE","(Departamento/ Municipio)"]
[1,{"$nulls":8},{"$f":"IFERROR(VLOOKUP(K21,DANE!$A$2:$C$751,3,),\"\")","v":""}]
[2,{"$nulls":8},{"$f":"IFERROR(VLOOKUP(K22,DANE!$A$2:$C$751,3,),\"\")","v":""}]
[3,{"$nulls":8},{"$f":"IFERROR(VLOOKUP(K23,DANE!$A$2:$C$751,3,),\"\")","v":""}]
[4,{"$nulls":8},{"$f":"IFERROR(VLOOKUP(K24,DANE!$A$2:$C$751,3,),\"\")","v":""}]
[5,{"$nulls":8},{"$f":"IFERROR(VLOOKUP(K25,DANE!$A$2:$C$751,3,),\"\")","v":""}]
[]
[]
[null,"FIRMA"]
[null,"NOMBRE"]
[null,null,null,"Representante Legal del Fideicomitente o Gestor"]
[null,null,null,{"$f":"CONCATENATE(\"PDA DEPARTAMENTO DE \",A13)","v":"PDA DEPARTAMENTO DE --------------"}]
[]
[null,"NOTAS"]
[null,"*Para todas las liberaciones de saldos de CONTRATOS, es requisito haberse efectuado el último pago y adjuntar copia del Acta de Liquidación del mismo. Ver MOE "]
[null,"*En caso de liberar el saldo del contrato y el mismo en el CDR, relacione este valor tanto en la columna de liberación contrato, como en la de liberación CDR."]
[]
[]
["PARA USO EXCLUSIVO DEL CONSORCIO FIA"]
["VISADO DE FIRMAS\nAnalista de Prespuesto",null,null,"LIQUIDACIÓN DE CONTRATOS\nDirector de PDA",null,null,"LIBERACIÓN DE CDR's\nAnalista Senior de Presupuesto",null,null,"LIBERACIÓN DE SALDOS\nAnalista de Presupuesto",null,"CONTRATOS\n\n           CDR's"]
[]
["Fecha:______________",null,"Firma:__________________","Fecha:_________________________",null,"Firma :_________________","Fecha:_______________________",null,"Firma:__________________","Fecha:","Firma:","____________________"]

{"sheet":"INSTRUCTIVO LIBERACIÓN","index":1,"n_rows":27,"n_cols":3,"rows_kept":27,"cut":false,"hidden":false,"merged":[]}
[]
[]
[null,null,"INSTRUCTIVO DILIGENCIAMIENTO FORMATO LIBERACIÓN DE CDR´s Y/O CONTRATOS"]
[]
[]
[]
["1. INFORMACIÓN BÁSICA"]
[null,"PAP - PDA DEL DEPARTAMENTO DE: ","Seleccione en la lista desplegable, el nombre del PDA que solicita la liberación del compromiso presupuestal"]
[null,"FECHA (DD/MM/AAAA): ","Fecha de diligenciamiento del formato"]
[null,"No. SOLICITUD:","Consecutivo del PDA "]
[]
["2. PROYECTOS PARA LIBERAR"]
[null,"No. CONTRATO","Registre el número asignado por el PDA del contrato a liberar"]
[null,"VALOR CONTRATO","Registre el valor del contrato objeto de liberación"]
[null,"NIT","Número de NIT del contratista"]
[null,"CONTRATISTA","Nombre completo del contratista "]
[null,"SALDO CONTRATO A LIBERAR","\nValor saldo del contrato a liberar, tenga en cuenta que este valor está soportado en documento \"Acta de liquidación del contrato\"\n"]
[null,"FECHA EXPEDICIÓN CDR","Registre la fecha de expedición de CDR al cual se encuentra asociado el contrato. Tenga en cuenta que si corresponde a un CDR prorrogado, se debe registrar la fecha de expedición inicial"]
[null,"No. CDR","Registre número de CDR al cual se encuentra asociado el contrato"]
[null,"SALDO CDR A LIBERAR","Registre el  valor del saldo del CDR a liberar, previa validación por parte de la unidad Gestora"]
[null,"CÓDIGO DANE","Se asigna automáticamente, después de seleccionar en la columna \"Departamento/Municipio\""]
[null,"DEPARTAMENTO/MUNICIPIO","Seleccione en la lista desplegable, el nombre del ente territorial cuyo origen de recursos es el CDR asociado al contrato objeto de liberación. \nLos nombres que se desplieguen en esta casilla, dependen del Departamento seleccionado en la \"INFORMACIÓN BÁSICA\""]
[null,"FUENTE DE RECURSOS","Seleccione en la lista desplegable, la fuente de recursos del CDR y/o contrato a liberar: \n* SGP - Sistema General de Participaciones\n* Regalías Directas\n* Regalías SGR - Fondo Compensación Regional\n* Nación (Audiencias Públicas)\n* Nación (Proyectos Estratégicos)  \n* Recursos CAR\n* Otros Recursos\n* Banco Mundial\n* Contrato Plan SGP\n* Contrato Plan Nación\n* Contrato Plan Regalías\n* Crédito BID\n* Recursos Crédito"]
[]
["3. FIRMA"]
[null,"FIRMA","Se registra la firma del Representante Legal del Fideicomitente o Gestor"]
[null,"NOMBRE","Se registra el nombre del Representante Legal del Fideicomitente o Gestor"]

{"sheet":"DANE","index":2,"n_rows":751,"n_cols":18,"rows_kept":751,"cut":false,"hidden":true,"merged":[[0,5,0,6]]}
["MUNICIPIO","DPTO/MPIO","DANE","DEPARTAMENTO",null,"TIPO DE GASTO",{"$nulls":11},"NEIVA"]
["AMAZONAS_","Departamento",91999,"AMAZONAS",null,"COMPONENTE","SUBCOMPONENTE"]
["EL ENCANTO","ANM",91263,"AMAZONAS",{"$f":"IF(A3=A2,1,\"\")","v":""},"Infraestructura en Agua y Saneamiento","Pre-Inversión"]
["LA CHORRERA","ANM",91405,"AMAZONAS",{"$f":"IF(A4=A3,1,\"\")","v":""},"Desarrollo Institucional","Inversión"]
["LA PEDRERA","ANM",91407,"AMAZONAS","","Proyectos Ambientales","Interventoría"]
["LA VICTORIA","ANM",91430,"AMAZONAS","","Desarrollo sector rural","Estructura Operativa"]
["MIRITI - PARANÁ","ANM",91460,"AMAZONAS","","Comunidades Indigenas/afrocolombianas","Otros"]
["PUERTO ALEGRÍA","ANM",91530,"AMAZONAS","","Gestión del Riesgo Sectorial"]
["PUERTO ARICA","ANM",91536,"AMAZONAS",""]
["PUERTO NARIÑO","Municipio",91540,"AMAZONAS","","FUENTE DE RECURSOS"]
["PUERTO SANTANDER","ANM",91669,"AMAZONAS","","SGP Agua potable y Saneamiento basico"]
["TARAPACÁ","ANM",91798,"AMAZONAS","","Regalías Directas"]
["ABEJORRAL","Municipio",5002,"ANTIOQUIA","","Regalías SGR - Fondo Compensación Regional"]
["ALEJANDRÍA","Municipio",5021,"ANTIOQUIA","","Regalías SGR - Fondo Desarrollo Regional"]
["AMAGA","Municipio",5030,"ANTIOQUIA","","Nación (Audiencias Públicas)"]
["AMALFI","Municipio",5031,"ANTIOQUIA","","Nación (Proyectos Estratégicos)"]
["ANDES","Municipio",5034,"ANTIOQUIA","","Recursos CAR"]
["ANORÍ","Municipio",5040,"ANTIOQUIA",{"$f":"IF(A19=A17,1,\"\")","v":""},"Otros Recursos"]
["ANGELOPOLIS","Municipio",5036,"ANTIOQUIA",{"$f":"IF(A20=A19,1,\"\")","v":""},"Banco Mundial"]
["ANTIOQUIA_","Departamento",5999,"ANTIOQUIA","","Contrato Plan SGP"]
["ANZA","Municipio",5044,"ANTIOQUIA","","Contrato Plan Nación"]
["ARBOLETES","Municipio",5051,"ANTIOQUIA","","Contrato Plan Regalías"]
["ARGELIA","Municipio",5055,"ANTIOQUIA","","Crédito BID"]
["ARMENIA","Municipio",5059,"ANTIOQUIA","","Recursos Crédito"]
["BETULIA","Municipio",5093,"ANTIOQUIA","","Nación Compromiso por Colombia"]
["BRICEÑO","Municipio",5107,"ANTIOQUIA",""]
["BURITICA","Municipio",5113,"ANTIOQUIA",""]
["CACERES","Municipio",5120,"ANTIOQUIA",""]
["CAICEDO","Municipio",5125,"ANTIOQUIA",""]
["CAMPAMENTO","Municipio",5134,"ANTIOQUIA",""]
["CAÑASGORDAS","Municipio",5138,"ANTIOQUIA",""]
["CARACOLI","Municipio",5142,"ANTIOQUIA"]
["CAREPA","Municipio",5147,"ANTIOQUIA",{"$f":"IF(A34=A32,1,\"\")","v":""}]
["CAROLINA","Municipio",5150,"ANTIOQUIA",{"$f":"IF(A35=A34,1,\"\")","v":""}]
["CAUCASIA","Municipio",5154,"ANTIOQUIA",{"$f":"IF(A37=A35,1,\"\")","v":""}]
["CIUDAD BOLIVAR","Municipio",5101,"ANTIOQUIA",{"$f":"IF(A38=A37,1,\"\")","v":""}]
["CISNEROS","Municipio",5190,"ANTIOQUIA",""]
["CONCORDIA","Municipio",5209,"ANTIOQUIA",""]
["DON MATIAS","Municipio",5237,"ANTIOQUIA",""]
["EL BAGRE","Municipio",5250,"ANTIOQUIA",""]
["FREDONIA","Municipio",5282,"ANTIOQUIA",""]
["FRONTINO","Municipio",5284,"ANTIOQUIA",""]
["GIRALDO","Municipio",5306,"ANTIOQUIA"]
["GOMEZ PLATA","Municipio",5310,"ANTIOQUIA",{"$f":"IF(A46=A44,1,\"\")","v":""}]
["GUATAPÉ","Municipio",5321,"ANTIOQUIA",{"$f":"IF(A47=A46,1,\"\")","v":""}]
["HELICONIA","Municipio",5347,"ANTIOQUIA",""]
["HISPANIA","Municipio",5353,"ANTIOQUIA",""]
["ITUANGO","Municipio",5361,"ANTIOQUIA",""]
["JARDIN","Municipio",5364,"ANTIOQUIA",""]
["JERICO","Municipio",5368,"ANTIOQUIA",""]
["LA CEJA","Municipio",5376,"ANTIOQUIA"]
["LA PINTADA","Municipio",5390,"ANTIOQUIA",{"$f":"IF(A54=A52,1,\"\")","v":""}]
["LA UNIÓN","Municipio",5400,"ANTIOQUIA",{"$f":"IF(A55=A54,1,\"\")","v":""}]
["LIBORINA","Municipio",5411,"ANTIOQUIA",""]
["MACEO","Municipio",5425,"ANTIOQUIA",""]
["MONTEBELLO","Municipio",5467,"ANTIOQUIA",""]
["MURINDO","Municipio",5475,"ANTIOQUIA",""]
["MUTATÁ","Municipio",5480,"ANTIOQUIA",""]
["NARIÑO","Municipio",5483,"ANTIOQUIA",""]
["NECHI","Municipio",5495,"ANTIOQUIA"]
["NECOCLI","Municipio",5490,"ANTIOQUIA",{"$f":"IF(A63=A61,1,\"\")","v":""}]
["OLAYA","Municipio",5501,"ANTIOQUIA",{"$f":"IF(A64=A63,1,\"\")","v":""}]
["PUEBLORRICO","Municipio",5576,"ANTIOQUIA",""]
["PUERTO BERRIO","Municipio",5579,"ANTIOQUIA",""]
["PUERTO NARE","Municipio",5585,"ANTIOQUIA",""]
["PUERTO TRIUNFO","Municipio",5591,"ANTIOQUIA",""]
["REMEDIOS","Municipio",5604,"ANTIOQUIA",""]
["SABANALARGA","Municipio",5628,"ANTIOQUIA",""]
["SALGAR","Municipio",5642,"ANTIOQUIA"]
["SAN ANDRÉS","Municipio",5647,"ANTIOQUIA",{"$f":"IF(A72=A70,1,\"\")","v":""}]
["SAN CARLOS","Municipio",5649,"ANTIOQUIA",{"$f":"IF(A73=A72,1,\"\")","v":""}]
["SAN FRANCISCO","Municipio",5652,"ANTIOQUIA",{"$f":"IF(A74=A73,1,\"\")","v":""}]
["SAN JERONIMO","Municipio",5656,"ANTIOQUIA",{"$f":"IF(A75=A74,1,\"\")","v":""}]
["SAN JOSE DE LA MONTAÑA","Municipio",5658,"ANTIOQUIA",""]
["SAN JUAN DE URABA","Municipio",5659,"ANTIOQUIA",""]
["SAN LUIS","Municipio",5660,"ANTIOQUIA",""]
["SAN RAFAEL","Municipio",5667,"ANTIOQUIA"]
["SAN ROQUE","Municipio",5670,"ANTIOQUIA",{"$f":"IF(A80=A78,1,\"\")","v":""}]
["SAN VICENTE DE FERRER","Municipio",5674,"ANTIOQUIA",""]
["SANTA BARBARA","Municipio",5679,"ANTIOQUIA",""]
{"$rows_left_out":672}
{"sheet":"LISTADOS","index":3,"n_rows":110,"n_cols":33,"rows_kept":110,"cut":false,"hidden":true,"merged":[]}
["DEPARTAMENTO","AMAZONAS_","ANTIOQUIA_","ARAUCA_","ATLÁNTICO_","BOLÍVAR_","BOYACÁ_","CALDAS_","CAQUETÁ_","CASANARE_","CAUCA_","CHOCÓ_","CÓRDOBA_","CUNDINAMARCA_","GUAINÍA_","GUAVIARE_","HUILA_","LA_GUAJIRA_","MAGDALENA_","META_","NARIÑO_","NEIVA_","NORTE_DE_SANTANDER_","PUTUMAYO_","QUINDIO_","RISARALDA_","SAN_ANDRÉS_","SANTANDER_","SUCRE_","TOLIMA_","VALLE_DEL_CAUCA_","VAUPÉS_","VICHADA_"]
["--------------","EL ENCANTO","ABEJORRAL",null,null,"ACHI","ALMEIDA","MANIZALES","FLORENCIA",null,"POPAYAN","CANTÓN DEL SAN PABLO","MONTERIA","AGUA DE DIOS","INIRIDA","SAN JOSE DEL GUAVIARE","ACEVEDO",null,null,"ACACIAS","PASTO","NEIVA.","ARBOLEDAS",null,"ARMENIA_","PEREIRA","SAN ANDRÉS.","AGUADA","BUENAVISTA__.","IBAGUE","ANDALUCIA","MITU","LA PRIMAVERA"]
["AMAZONAS_","LA CHORRERA","ALEJANDRÍA",null,null,"ARENAL","AQUITANIA","AGUADAS","ALBANIA",null,"ARGELIA_","RIO QUITO","AYAPEL","ALBAN","BARRANCO MINAS","CALAMAR","AGRADO",null,null,"BARRANCA DE UPIA","ALBAN_",null,"BOCHALEMA",null,"BUENAVISTA__","APIA","PROVIDENCIA","ALBANIA_","CAIMITO","ALPUJARRA","GUADALAJARA DE BUGA","CARURU","SANTA ROSALIA"]
["ANTIOQUIA_","LA PEDRERA","AMAGA",null,null,"ARJONA","BELEN","ANSERMA","BELEN DE LOS ANDAQUIES",null,"BALBOA","ACANDÍ","BUENAVISTA_","ANAPOIMA","MAPIRIPANA","EL RETORNO","AIPE",null,null,"CABUYARO","ALDANA",null,"CACOTA",null,"CALARCA","BALBOA_",null,"ARATOCA","COLOSO","ALVARADO","CALIMA","PACOA","CUMARIBO"]
["ARAUCA_","LA VICTORIA","AMALFI",null,null,"ARROYOHONDO","BETEITIVA","ARANZAZU","CARTAGENA DEL CHAIRA",null,"BOLÍVAR","SAN JOSÉ DEL PALMAR","CANALETE","ANOLAIMA","SAN FELIPE","MIRAFLORES_","ALGECIRAS",null,null,"CUMARAL","ANCUYA",null,"CACHIRA",null,"CIRCASIA","BELEN DE UMBRIA",null,"BARBOSA","CHALAN","AMBALEMA","YUMBO","TARAIRA"]
["ATLÁNTICO_","MIRITI - PARANÁ","ANDES",null,null,"BARRANCO DE LOBA","BOAVITA","BELALCAZAR","CURILLO",null,"BUENOS AIRES",null,"CHINU","ARBELAEZ","PUERTO COLOMBIA",null,"ALTAMIRA",null,null,"EL CALVARIO","BARBACOAS",null,"CHINACOTA",null,"CÓRDOBA_.","GUATICA",null,"BARICHARA","EL ROBLE","ANZOATEGUI","ZARZAL","PAPUNAUA"]
["BOLÍVAR_","PUERTO ALEGRÍA","ANGELOPOLIS",null,null,"CICUCO","BOYACÁ.","CHINCHINA","EL DONCELLO",null,"CAJIBIO",null,"COTORRA","BELTRAN","LA GUADALUPE",null,"BARAYA",null,null,"EL CASTILLO","BELEN_",null,"DURANIA",null,"FILANDIA","MARSELLA",null,"BETULIA_","GALERAS","ARMERO (GUAYABAL)",null,"YAVARATÉ"]
["BOYACÁ_","PUERTO ARICA","SANTAFE DE ANTIOQUIA",null,null,"CÓRDOBA","BRICEÑO_","FILADELFIA","PAUJIL",null,"CALOTO",null,"LA APARTADA","BITUIMA","CACAHUAL",null,"COLOMBIA",null,null,"EL DORADO","BUESACO",null,"EL CARMEN",null,"GENOVA","MISTRATO",null,"CALIFORNIA","GUARANDA","ATACO"]
["CALDAS_","PUERTO NARIÑO","ANZA",null,null,"CLEMENCIA","BUENAVISTA","LA DORADA","LA MONTAÑITA",null,"EL TAMBO",null,"LOS CÓRDOBAS","BOJACA","PANA PANA",null,"GARZON",null,null,"FUENTE DE ORO","CÓRDOBA__",null,"EL ZULIA",null,"LA TEBAIDA","PUEBLO RICO",null,"CAPITANEJO","LA UNION_","CAJAMARCA"]
["CAQUETÁ_","PUERTO SANTANDER","ARBOLETES",null,null,"EL GUAMO","CALDAS","LA MERCED","MILAN",null,"GUACHENE",null,"MOÑITOS","CABRERA","MORICHAL",null,"GIGANTE",null,null,"GRANADA_","CUASPUD-CARLOSAMA",null,"HACARI",null,"MONTENEGRO","QUINCHIA",null,"CARCASI","LOS PALMITOS","CASABIANCA"]
["CASANARE_","TARAPACÁ","ARGELIA",null,null,"EL PEÑON","CAMPOHERMOSO","MANZANARES","MORELIA",null,"GUAPI",null,"PLANETA RICA","CACHIPAY",null,null,"GUADALUPE",null,null,"GUAMAL","CUMBAL",null,"HERRAN",null,"PIJAO","SANTA ROSA DE CABAL",null,"CERRITO","MAJAGUAL","COELLO"]
["CAUCA_",null,"ARMENIA",null,null,"MAHATES","CHINAVITA","MARMATO","PUERTO RICO",null,"INZA",null,"PUEBLO NUEVO","CAJICA",null,null,"IQUIRA",null,null,"MAPIRIPAN","CHACHAGUI",null,"LABATECA",null,"QUIMBAYA","SANTUARIO_",null,"CHARALA","MORROA","COYAIMA"]
["CHOCÓ_",null,"BETULIA",null,null,"MARIA LA BAJA","CHIQUINQUIRA","MARQUETALIA","SAN JOSE DEL FRAGUA",null,"JAMBALO",null,"PUERTO ESCONDIDO","CAPARRAPI",null,null,"LA ARGENTINA",null,null,"MESETAS","EL PEÑOL",null,"LA ESPERANZA",null,"SALENTO",null,null,"CHIMA","SAN ANTONIO DE PALMITO","CUNDAY"]
["CÓRDOBA_",null,"BRICEÑO",null,null,"MONTECRISTO","CHISCAS","MARULANDA","SAN VICENTE DEL CAGUAN",null,"LA SIERRA",null,"PUERTO LIBERTADOR","CAQUEZA",null,null,"LA PLATA",null,null,"LA URIBE","EL ROSARIO",null,"LOS PATIOS",{"$nulls":4},"CHIPATA","SAMPUES","ESPINAL"]
["CUNDINAMARCA_",null,"BURITICA",null,null,"MOMPOS","CHITARAQUE","NEIRA","SOLANO",null,"LA VEGA",null,"SAN BERNARDO DEL VIENTO","CARMEN DE CARUPA",null,null,"NATAGA",null,null,"LEJANIAS","EL TABLON",null,"LOURDES",{"$nulls":4},"CIMITARRA","SAN BENITO ABAD","FALAN"]
["GUAINÍA_",null,"CACERES",null,null,"NOROSI","CIENEGA","NORCASIA","SOLITA ",null,"LOPEZ DE MICAY",null,"SAN PELAYO","CHAGUANI",null,null,"OPORAPA",null,null,"PUERTO CONCORDIA","EL TAMBO_",null,"PAMPLONA",{"$nulls":4},"CONCEPCION","SAN MARCOS","FLANDES"]
["GUAVIARE_",null,"CAICEDO",null,null,"PINILLOS","COMBITA","PACORA","VALPARAÍSO",null,"MERCADERES",null,"TIERRALTA","CHIPAQUE",null,null,"PAICOL",null,null,"PUERTO GAITAN","FUNES",null,"PAMPLONITA",{"$nulls":4},"CONFINES","SAN ONOFRE","FRESNO"]
["HUILA_",null,"CAMPAMENTO",null,null,"REGIDOR","CORRALES","PALESTINA",null,null,"MORALES",null,"VALENCIA","CHOACHI",null,null,"PALERMO",null,null,"PUERTO LOPEZ","GUACHUCAL",null,"PUERTO SANTANDER_",{"$nulls":4},"CONTRATACION","SINCE","GUAMO"]
["LA_GUAJIRA_",null,"CAÑASGORDAS",null,null,"RIO VIEJO","COVARACHIA","PENSILVANIA",null,null,"PADILLA",null,null,"CHOCÓNTA",null,null,"PITAL",null,null,"PUERTO LLERAS","GUALMATAN",null,"SALAZAR DE LAS PALMAS",{"$nulls":4},"COROMORO","SUCRE.","HERVEO"]
["MAGDALENA_",null,"CARACOLI",null,null,"SAN CRISTOBAL","CUBARA","RIOSUCIO",null,null,"PAEZ (BELALCAZAR",null,null,"CUCUNUBA",null,null,"PITALITO",null,null,"PUERTO RICO_","IMUES",null,"SAN CAYETANO_",{"$nulls":4},"CURITI","TOLU","HONDA"]
["META_",null,"CAREPA",null,null,"SAN ESTANISLAO","CUCAITA","RISARALDA",null,null,"PATIA (EL BORDO)",null,null,"EL COLEGIO",null,null,"RIVERA",null,null,"SAN CARLOS DE GUAROA","IPIALES",null,"SANTIAGO",{"$nulls":4},"EL CARMEN DE CHUCURI","TOLUVIEJO","ICONONZO"]
["NARIÑO_",null,"CAROLINA",null,null,"SAN JACINTO","CHIQUIZA","SALAMINA",null,null,"PIAMONTE",null,null,"EL PEÑON_",null,null,"SALADOBLANCO",null,null,"SAN JUAN DE ARAMA","LA CRUZ",null,"SILOS",{"$nulls":4},"EL PLAYON",null,"LIBANO"]
["NEIVA_",null,"CAUCASIA",null,null,"SAN JACINTO DEL CAUCA","CHIVOR","SAMANA",null,null,"PIENDAMO",null,null,"EL ROSAL",null,null,"SAN AGUSTIN",null,null,null,"LA LLANADA",null,"TIBU",{"$nulls":4},"ENCINO",null,"MARIQUITA"]
["NORTE_DE_SANTANDER_",null,"CISNEROS",null,null,"SAN JUAN DE NEPOMUCENO","DUITAMA","SAN JOSE",null,null,"PUERTO TEJADA",null,null,"FACATATIVA",null,null,"SANTA MARIA",null,null,null,"LA UNION",null,"TOLEDO",{"$nulls":4},"ENCISO",null,"MURILLO"]
["PUTUMAYO_",null,"CONCORDIA",null,null,"SANTA CATALINA","EL COCUY","SUPIA",null,null,"PURACE",null,null,"FOMEQUE",null,null,"TARQUI",null,null,null,"LINARES",null,"VILLACARO",{"$nulls":4},"FLORIAN",null,"NATAGAIMA"]
["QUINDIO_",null,"DON MATIAS",null,null,"SANTA ROSA DEL SUR","EL ESPINO","VICTORIA",null,null,"ROSAS",null,null,"FOSCA",null,null,"TESALIA",null,null,null,"LOS ANDES",null,"VILLA DEL ROSARIO",{"$nulls":4},"FLORIDABLANCA",null,"ORTEGA"]
["RISARALDA_",null,"EL BAGRE",null,null,"SIMITI","FIRAVITOBA","VILLAMARIA",null,null,"SAN SEBASTIAN",null,null,"FUQUENE",null,null,"TELLO",null,null,null,"MALLAMA",{"$nulls":6},"GALAN",null,"PALOCABILDO"]
["SAN_ANDRÉS_",null,"FREDONIA",null,null,"SOPLAVIENTO","GACHANTIVA","VITERBO",null,null,"SANTANDER DE QUILICHAO",null,null,"FUSAGASUGA",null,null,"TERUEL",null,null,null,"MOSQUERA",{"$nulls":6},"GIRON",null,"PIEDRAS"]
["SANTANDER_",null,"FRONTINO",null,null,"TALAIGUA NUEVO","GARAGOA",null,null,null,"SANTA ROSA",null,null,"GACHALA",null,null,"TIMANA",null,null,null,"NARIÑO.",{"$nulls":6},"GUADALUPE_",null,"PLANADAS"]
["SUCRE_",null,"GIRALDO",null,null,"TIQUISIO","GUACAMAYAS",null,null,null,"SILVIA",null,null,"GACHANCIPA",null,null,"VILLAVIEJA",null,null,null,"OSPINA",{"$nulls":6},"GUAVATA",null,"PRADO"]
["TOLIMA_",null,"GOMEZ PLATA",null,null,"TURBACO","GUAYATA",null,null,null,"SOTARA",null,null,"GACHETA",{"$nulls":6},"POLICARPA",{"$nulls":6},"GUEPSA",null,"PURIFICACION"]
["VALLE_DEL_CAUCA_",null,"GUATAPÉ",null,null,"VILLANUEVA","GUICAN",null,null,null,"SUAREZ",null,null,"GAMA",{"$nulls":6},"POTOSI",{"$nulls":6},"HATO",null,"RIOBLANCO"]
["VAUPÉS_",null,"HELICONIA",null,null,null,"IZA",null,null,null,"TIMBIO",null,null,"GIRARDOT",{"$nulls":6},"PUERRES",{"$nulls":6},"JESUS MARIA",null,"RONCESVALLES"]
["VICHADA_",null,"HISPANIA",null,null,null,"JERICO_",null,null,null,"TORIBIO",null,null,"GRANADA",{"$nulls":6},"PUPIALES",{"$nulls":6},"LA BELLEZA",null,"ROVIRA"]
[null,null,"ITUANGO",null,null,null,"LABRANZAGRANDE",null,null,null,"TOTORO",null,null,"GUACHETA",{"$nulls":6},"RICAURTE_",{"$nulls":6},"LA PAZ",null,"SALDAÑA"]
[null,null,"JARDIN",null,null,null,"LA UVITA",{"$nulls":6},"GUADUAS",{"$nulls":6},"ROBERTO PAYAN",{"$nulls":6},"LEBRIJA",null,"SAN ANTONIO"]
[null,null,"JERICO",null,null,null,"VILLA DE LEYVA",{"$nulls":6},"GUASCA",{"$nulls":6},"SANDONA",{"$nulls":6},"LOS SANTOS",null,"SAN LUIS_"]
[null,null,"LA CEJA",null,null,null,"MACANAL",{"$nulls":6},"GUATAQUI",{"$nulls":6},"SAN BERNARDO_",{"$nulls":6},"MACARAVITA",null,"SANTA ISABEL"]
[null,null,"LA PINTADA",null,null,null,"MARIPI",{"$nulls":6},"GUATAVITA",{"$nulls":6},"SAN LORENZO",{"$nulls":6},"MALAGA",null,"SUAREZ_"]
[null,null,"LA UNIÓN",null,null,null,"MIRAFLORES",{"$nulls":6},"GUAYABAL DE SIQUIMA",{"$nulls":6},"SAN PABLO",{"$nulls":6},"MATANZA",null,"VALLE DE S JUAN"]
[null,null,"LIBORINA",null,null,null,"MONGUI",{"$nulls":6},"GUAYABETAL",{"$nulls":6},"SAN PEDRO DE CARTAGO",{"$nulls":6},"MOGOTES",null,"VENADILLO"]
[null,null,"MACEO",null,null,null,"MUZO",{"$nulls":6},"GUTIERREZ",{"$nulls":6},"SANTA CRUZ",{"$nulls":6},"MOLAGAVITA",null,"VILLAHERMOSA"]
[null,null,"MONTEBELLO",null,null,null,"NOBSA",{"$nulls":6},"JERUSALEN",{"$nulls":6},"SAPUYES",{"$nulls":6},"OCAMONTE",null,"VILLARRICA"]
[null,null,"MURINDO",null,null,null,"NUEVO COLON",{"$nulls":6},"JUNIN",{"$nulls":6},"TANGUA",{"$nulls":6},"OIBA"]
[null,null,"MUTATÁ",null,null,null,"OICATA",{"$nulls":6},"LA CALERA",{"$nulls":6},"TUMACO",{"$nulls":6},"PALMAR"]
[null,null,"NARIÑO",null,null,null,"OTANCHE",{"$nulls":6},"LA MESA",{"$nulls":6},"TUQUERRES",{"$nulls":6},"PALMAS DEL SOCORRO"]
[null,null,"NECOCLI",null,null,null,"PACHAVITA",{"$nulls":6},"LA PALMA",{"$nulls":6},"YACUANQUER",{"$nulls":6},"PARAMO"]
[null,null,"NECHI",null,null,null,"PAEZ",{"$nulls":6},"LA PEÑA",{"$nulls":13},"PINCHOTE"]
[null,null,"OLAYA",null,null,null,"PAIPA",{"$nulls":6},"LA VEGA_",{"$nulls":13},"PUENTE NACIONAL"]
[null,null,"PUEBLORRICO",null,null,null,"PAJARITO",{"$nulls":6},"LENGUAZAQUE",{"$nulls":13},"PUERTO PARRA"]
[null,null,"PUERTO BERRIO",null,null,null,"PAUNA",{"$nulls":6},"MACHETA",{"$nulls":13},"RIONEGRO"]
[null,null,"PUERTO NARE",null,null,null,"PAYA",{"$nulls":6},"MADRID",{"$nulls":13},"SABANA DE TORRES"]
[null,null,"PUERTO TRIUNFO",null,null,null,"PAZ DEL RIO",{"$nulls":6},"MANTA",{"$nulls":13},"SAN ANDRES"]
[null,null,"REMEDIOS",null,null,null,"PESCA",{"$nulls":6},"MEDINA",{"$nulls":13},"SAN GIL"]
[null,null,"SABANALARGA",null,null,null,"QUIPAMA",{"$nulls":6},"MOSQUERA",{"$nulls":13},"SAN JOAQUIN"]
[null,null,"SALGAR",null,null,null,"RAMIRIQUI",{"$nulls":6},"NARIÑO__",{"$nulls":13},"SAN VICENTE DE CHUCURI"]
[null,null,"SAN ANDRÉS",null,null,null,"RAQUIRA",{"$nulls":6},"NEMOCON",{"$nulls":13},"SOCORRO"]
[null,null,"SAN CARLOS",null,null,null,"RONDON",{"$nulls":6},"NILO",{"$nulls":13},"SUCRE"]
[null,null,"SAN FRANCISCO",null,null,null,"SABOYA",{"$nulls":6},"NIMAIMA",{"$nulls":13},"SURATA"]
[null,null,"SAN JERONIMO",null,null,null,"SACHICA",{"$nulls":6},"NOCAIMA",{"$nulls":13},"TONA"]
[null,null,"SAN JOSE DE LA MONTAÑA",null,null,null,"SAMACA",{"$nulls":6},"VENECIA (OSPINA PEREZ)",{"$nulls":13},"VELEZ"]
[null,null,"SAN JUAN DE URABA",null,null,null,"SAN EDUARDO",{"$nulls":6},"PACHO",{"$nulls":13},"VETAS"]
[null,null,"SAN LUIS",null,null,null,"SAN JOSE DE PARE",{"$nulls":6},"PAIME",{"$nulls":13},"VILLANUEVA_"]
[null,null,"SAN RAFAEL",null,null,null,"SAN LUIS DE GACENO",{"$nulls":6},"PANDI",{"$nulls":13},"ZAPATOCA"]
[null,null,"SAN ROQUE",null,null,null,"SAN MATEO",{"$nulls":6},"PARATEBUENO"]
[null,null,"SAN VICENTE DE FERRER",null,null,null,"SAN MIGUEL DE SEMA",{"$nulls":6},"PASCA"]
[null,null,"SANTA BARBARA",null,null,null,"SAN PABLO DE BORBUR",{"$nulls":6},"PUERTO SALGAR"]
[null,null,"SANTA ROSA DE OSOS",null,null,null,"SANTANA",{"$nulls":6},"PULI"]
[null,null,"SANTUARIO",null,null,null,"SANTA ROSA DE VITERBO",{"$nulls":6},"QUEBRADANEGRA"]
[null,null,"SEGOVIA",null,null,null,"SANTA SOFIA",{"$nulls":6},"QUETAME"]
[null,null,"SONSON",null,null,null,"SOATA",{"$nulls":6},"QUIPILE"]
[null,null,"TITIRIBI",null,null,null,"SOCOTA",{"$nulls":6},"APULO"]
[null,null,"TOLEDO",null,null,null,"SOGAMOSO",{"$nulls":6},"RICAURTE"]
[null,null,"URAMITA",null,null,null,"SORA",{"$nulls":6},"SAN  ANTONIO DEL  TEQUENDAMA"]
[null,null,"URRAO",null,null,null,"SOTAQUIRA",{"$nulls":6},"SAN BERNARDO"]
[null,null,"ANORÍ",null,null,null,"SORACA",{"$nulls":6},"SAN CAYETANO"]
[null,null,"CIUDAD BOLIVAR",null,null,null,"SUTAMARCHAN",{"$nulls":6},"SAN FRANCISCO_"]
[null,null,"VEGACHI",null,null,null,"SUTATENZA",{"$nulls":6},"SAN JUAN DE RIOSECO"]
[null,null,"VENECIA",null,null,null,"TASCO",{"$nulls":6},"SASAIMA"]
[null,null,"VIGIA DEL FUERTE",null,null,null,"TENZA",{"$nulls":6},"SESQUILE"]
{"$rows_left_out":30}